{"text_format":"1","workbook":"xlsx","n_sheets":3,"sheets":["FORMULACIÓN SIGI ","Plan de Acción GPS","LISTAS"],"not_rendered":{"charts":0,"images":1,"macros":1,"external_links":2,"defined_names":63,"comments":0,"pivot_tables":0},"unopened":[],"bounds":{"document_bytes":16777216,"sheet_cells":100000,"rows_first":2000,"rows_last":500,"rows_between":2000,"halvings":0,"cell_chars":16384,"cell_head_chars":4096},"cells_cut":0,"cells_raw":0,"read":"whole","date_system":"1900"}

{"sheet":"FORMULACIÓN SIGI ","index":0,"n_rows":295,"n_cols":19,"rows_kept":295,"cut":false,"hidden":false,"merged":[[17,0,17,17],[5,0,5,1],[9,2,9,6],[1,3,3,15],[1,0,3,2],[11,0,12,1],[11,3,12,6],[11,8,11,11],[12,16,12,17],[12,13,12,15],[13,13,13,16],[14,13,14,16],[15,13,15,16],[7,0,7,1],[7,2,7,6],[9,0,9,1],[5,2,5,6],[7,8,7,9],[7,10,7,14],[9,8,9,14],[13,0,15,0],[13,1,15,1],[13,3,15,3],[13,4,15,6],[13,8,15,8],[11,13,11,17],[13,9,15,9],[13,10,15,10],[13,11,15,11]]}
[]
[null,null,null,"FORMULACIÓN PLAN DE ACCIÓN ",null,null,null,null,null,null,null,null,null,null,null,null,"Código:              ","DE01-F03"]
[null,null,null,null,null,null,null,null,null,null,null,null,null,null,null,null,"Versión:               ",16]
[null,null,null,null,null,null,null,null,null,null,null,null,null,null,null,null,"Fecha:             "," 2023-12-28"]
[]
["VIGENCIA:",null,2024]
[]
["ÁREA:",null,null,null,null,null,null,{"$f":"HLOOKUP(C8,LISTAS!A1:L10,10,0)","v":{"$error":"#N/A"}},"ÁREA Y/O DEPENDENCIA RESPONSABLE:",null,null,null,null,null,null,null,"FICHA:",{"$f":"IF(K8=0,\"\",VLOOKUP(K8,LISTAS!A15:B52,2,0))","v":""}]
[]
["∑ PART. % PRODUCTOS ",null,{"$f":"SUMIF(A20:A396,\"Producto\",K20:K396)","v":0},null,null,null,null,null,{"$f":"IF(C10=0%,\"\",IF(C10=100%,\"Ponderación completa\",IF(C10<100%,CONCATENATE(\"Aun falta por asignar \",TEXT(G11,\"#%\")),\"La sumatoria de ponderadores de productos no puede superar el 100%\")))","v":""}]
[null,null,null,null,null,null,{"$f":"100%-C10","v":1}]
["Vo.Bo. REVISIÓN OAP",null,null,"JEFE OFICINA DE PLANEACIÓN RESPONSABLE DE LA APROBACIÓN ",null,null,null,null,"FIRMAS ÁREAS/DEPENDENCIAS  RESPONSABLES DE LA FICHA, RELACIÓN DE LAS ÁREAS/DEPENDENCIAS  RESPONSABLES DE LA FICHA",null,null,null,null,"OTRAS  DEPENDENCIAS RESPONSABLES DE LA EJECUCIÓN DE  ACTIVIDADES QUE AUTORIZACION LA FORMULACIÓN"]
[null,null,null,null,null,null,null,null,null," 1° Nivel","2° Nivel","3° Nivel",null,"DEPENDENCIA",null,null,"NOMBRE JEFE "]
["Nombre:",null,null,"Nombre:",null,null,null,null,"Nombre:"]
[]
{"$rows_left_out":281}
{"sheet":"Plan de Acción GPS","index":1,"n_rows":202,"n_cols":18,"rows_kept":202,"cut":false,"hidden":true,"merged":[[0,0,0,17]]}
["Dependencia formuladora 25-GRUPO TRABAJO SISTEMAS DE INFORMACION"]
["Ident. Fila","Categoría","Objetivo estratégico","Indicador estratégico","Estrategia","Insumo de planeación del que se extrajo el producto","Fuente de financiación","Política(s) MIPG","Asociación a planes","Descripción del producto o actividad","Participación %","Meta","Unidad de medida","Componente 1 para formula","Componente 2 para formula","Fecha inicio","Fecha fin","Dependencias responsables de la ejecución de actividades"]
[{"$f":"VLOOKUP('FORMULACIÓN SIGI '!A20,LISTAS!$A$58:$B$59,2,0)","v":{"$error":"#N/A"}},{"$f":"VLOOKUP('FORMULACIÓN SIGI '!B20,LISTAS!$A$61:$B$65,2,0)","v":{"$error":"#N/A"}},{"$f":"VLOOKUP('FORMULACIÓN SIGI '!C20,LISTAS!$A$67:$B$74,2,0)","v":{"$error":"#N/A"}},{"$f":"VLOOKUP('FORMULACIÓN SIGI '!D20,LISTAS!$A$76:$B$82,2,0)","v":{"$error":"#N/A"}},{"$f":"VLOOKUP('FORMULACIÓN SIGI '!E20,LISTAS!$A$84:$B$91,2,0)","v":{"$error":"#N/A"}},{"$f":"VLOOKUP('FORMULACIÓN SIGI '!F20,LISTAS!$A$93:$B$145,2,0)","v":{"$error":"#N/A"}},{"$f":"VLOOKUP('FORMULACIÓN SIGI '!G20,LISTAS!$A$113:B124,2,0)","v":{"$error":"#N/A"}},{"$f":"VLOOKUP('FORMULACIÓN SIGI '!H20,LISTAS!$A$126:$B$145,2,0)","v":{"$error":"#N/A"}},{"$f":"VLOOKUP('FORMULACIÓN SIGI '!I20,LISTAS!$A$147:$B$171,2,0)","v":{"$error":"#N/A"}},{"$f":"+'FORMULACIÓN SIGI '!J20","v":0},{"$f":"+'FORMULACIÓN SIGI '!K20","v":0},{"$f":"+'FORMULACIÓN SIGI '!L20","v":0},{"$f":"VLOOKUP('FORMULACIÓN SIGI '!M20,LISTAS!$A$173:$B$174,2,0)","v":{"$error":"#N/A"}},{"$f":"+'FORMULACIÓN SIGI '!N20","v":0},{"$f":"+'FORMULACIÓN SIGI '!O20","v":0},{"$f":"+'FORMULACIÓN SIGI '!P20","v":"00:00:00"},{"$f":"+'FORMULACIÓN SIGI '!Q20","v":"00:00:00"},{"$f":"+'FORMULACIÓN SIGI '!R20","v":0}]
[{"$f":"VLOOKUP('FORMULACIÓN SIGI '!A21,LISTAS!$A$58:$B$59,2,0)","v":{"$error":"#N/A"}},{"$f":"VLOOKUP('FORMULACIÓN SIGI '!B21,LISTAS!$A$61:$B$65,2,0)","v":{"$error":"#N/A"}},{"$f":"VLOOKUP('FORMULACIÓN SIGI '!C21,LISTAS!$A$67:$B$74,2,0)","v":{"$error":"#N/A"}},{"$f":"VLOOKUP('FORMULACIÓN SIGI '!D21,LISTAS!$A$76:$B$82,2,0)","v":{"$error":"#N/A"}},{"$f":"VLOOKUP('FORMULACIÓN SIGI '!E21,LISTAS!$A$84:$B$91,2,0)","v":{"$error":"#N/A"}},{"$f":"VLOOKUP('FORMULACIÓN SIGI '!F21,LISTAS!$A$93:$B$145,2,0)","v":{"$error":"#N/A"}},{"$f":"VLOOKUP('FORMULACIÓN SIGI '!G21,LISTAS!$A$113:B125,2,0)","v":{"$error":"#N/A"}},{"$f":"VLOOKUP('FORMULACIÓN SIGI '!H21,LISTAS!$A$126:$B$145,2,0)","v":{"$error":"#N/A"}},{"$f":"VLOOKUP('FORMULACIÓN SIGI '!I21,LISTAS!$A$147:$B$171,2,0)","v":{"$error":"#N/A"}},{"$f":"+'FORMULACIÓN SIGI '!J21","v":0},{"$f":"+'FORMULACIÓN SIGI '!K21","v":0},{"$f":"+'FORMULACIÓN SIGI '!L21","v":0},{"$f":"VLOOKUP('FORMULACIÓN SIGI '!M21,LISTAS!$A$173:$B$174,2,0)","v":{"$error":"#N/A"}},{"$f":"+'FORMULACIÓN SIGI '!N21","v":0},{"$f":"+'FORMULACIÓN SIGI '!O21","v":0},{"$f":"+'FORMULACIÓN SIGI '!P21","v":"00:00:00"},{"$f":"+'FORMULACIÓN SIGI '!Q21","v":"00:00:00"},{"$f":"+'FORMULACIÓN SIGI '!R21","v":0}]
[{"$f":"VLOOKUP('FORMULACIÓN SIGI '!A22,LISTAS!$A$58:$B$59,2,0)","v":{"$error":"#N/A"}},{"$f":"VLOOKUP('FORMULACIÓN SIGI '!B22,LISTAS!$A$61:$B$65,2,0)","v":{"$error":"#N/A"}},{"$f":"VLOOKUP('FORMULACIÓN SIGI '!C22,LISTAS!$A$67:$B$74,2,0)","v":{"$error":"#N/A"}},{"$f":"VLOOKUP('FORMULACIÓN SIGI '!D22,LISTAS!$A$76:$B$82,2,0)","v":{"$error":"#N/A"}},{"$f":"VLOOKUP('FORMULACIÓN SIGI '!E22,LISTAS!$A$84:$B$91,2,0)","v":{"$error":"#N/A"}},{"$f":"VLOOKUP('FORMULACIÓN SIGI '!F22,LISTAS!$A$93:$B$145,2,0)","v":{"$error":"#N/A"}},{"$f":"VLOOKUP('FORMULACIÓN SIGI '!G22,LISTAS!$A$113:B126,2,0)","v":{"$error":"#N/A"}},{"$f":"VLOOKUP('FORMULACIÓN SIGI '!H22,LISTAS!$A$126:$B$145,2,0)","v":{"$error":"#N/A"}},{"$f":"VLOOKUP('FORMULACIÓN SIGI '!I22,LISTAS!$A$147:$B$171,2,0)","v":{"$error":"#N/A"}},{"$f":"+'FORMULACIÓN SIGI '!J22","v":0},{"$f":"+'FORMULACIÓN SIGI '!K22","v":0},{"$f":"+'FORMULACIÓN SIGI '!L22","v":0},{"$f":"VLOOKUP('FORMULACIÓN SIGI '!M22,LISTAS!$A$173:$B$174,2,0)","v":{"$error":"#N/A"}},{"$f":"+'FORMULACIÓN SIGI '!N22","v":0},{"$f":"+'FORMULACIÓN SIGI '!O22","v":0},{"$f":"+'FORMULACIÓN SIGI '!P22","v":"00:00:00"},{"$f":"+'FORMULACIÓN SIGI '!Q22","v":"00:00:00"},{"$f":"+'FORMULACIÓN SIGI '!R22","v":0}]
[{"$f":"VLOOKUP('FORMULACIÓN SIGI '!A23,LISTAS!$A$58:$B$59,2,0)","v":{"$error":"#N/A"}},{"$f":"VLOOKUP('FORMULACIÓN SIGI '!B23,LISTAS!$A$61:$B$65,2,0)","v":{"$error":"#N/A"}},{"$f":"VLOOKUP('FORMULACIÓN SIGI '!C23,LISTAS!$A$67:$B$74,2,0)","v":{"$error":"#N/A"}},{"$f":"VLOOKUP('FORMULACIÓN SIGI '!D23,LISTAS!$A$76:$B$82,2,0)","v":{"$error":"#N/A"}},{"$f":"VLOOKUP('FORMULACIÓN SIGI '!E23,LISTAS!$A$84:$B$91,2,0)","v":{"$error":"#N/A"}},{"$f":"VLOOKUP('FORMULACIÓN SIGI '!F23,LISTAS!$A$93:$B$145,2,0)","v":{"$error":"#N/A"}},{"$f":"VLOOKUP('FORMULACIÓN SIGI '!G23,LISTAS!$A$113:B127,2,0)","v":{"$error":"#N/A"}},{"$f":"VLOOKUP('FORMULACIÓN SIGI '!H23,LISTAS!$A$126:$B$145,2,0)","v":{"$error":"#N/A"}},{"$f":"VLOOKUP('FORMULACIÓN SIGI '!I23,LISTAS!$A$147:$B$171,2,0)","v":{"$error":"#N/A"}},{"$f":"+'FORMULACIÓN SIGI '!J23","v":0},{"$f":"+'FORMULACIÓN SIGI '!K23","v":0},{"$f":"+'FORMULACIÓN SIGI '!L23","v":0},{"$f":"VLOOKUP('FORMULACIÓN SIGI '!M23,LISTAS!$A$173:$B$174,2,0)","v":{"$error":"#N/A"}},{"$f":"+'FORMULACIÓN SIGI '!N23","v":0},{"$f":"+'FORMULACIÓN SIGI '!O23","v":0},{"$f":"+'FORMULACIÓN SIGI '!P23","v":"00:00:00"},{"$f":"+'FORMULACIÓN SIGI '!Q23","v":"00:00:00"},{"$f":"+'FORMULACIÓN SIGI '!R23","v":0}]
[{"$f":"VLOOKUP('FORMULACIÓN SIGI '!A24,LISTAS!$A$58:$B$59,2,0)","v":{"$error":"#N/A"}},{"$f":"VLOOKUP('FORMULACIÓN SIGI '!B24,LISTAS!$A$61:$B$65,2,0)","v":{"$error":"#N/A"}},{"$f":"VLOOKUP('FORMULACIÓN SIGI '!C24,LISTAS!$A$67:$B$74,2,0)","v":{"$error":"#N/A"}},{"$f":"VLOOKUP('FORMULACIÓN SIGI '!D24,LISTAS!$A$76:$B$82,2,0)","v":{"$error":"#N/A"}},{"$f":"VLOOKUP('FORMULACIÓN SIGI '!E24,LISTAS!$A$84:$B$91,2,0)","v":{"$error":"#N/A"}},{"$f":"VLOOKUP('FORMULACIÓN SIGI '!F24,LISTAS!$A$93:$B$145,2,0)","v":{"$error":"#N/A"}},{"$f":"VLOOKUP('FORMULACIÓN SIGI '!G24,LISTAS!$A$113:B128,2,0)","v":{"$error":"#N/A"}},{"$f":"VLOOKUP('FORMULACIÓN SIGI '!H24,LISTAS!$A$126:$B$145,2,0)","v":{"$error":"#N/A"}},{"$f":"VLOOKUP('FORMULACIÓN SIGI '!I24,LISTAS!$A$147:$B$171,2,0)","v":{"$error":"#N/A"}},{"$f":"+'FORMULACIÓN SIGI '!J24","v":0},{"$f":"+'FORMULACIÓN SIGI '!K24","v":0},{"$f":"+'FORMULACIÓN SIGI '!L24","v":0},{"$f":"VLOOKUP('FORMULACIÓN SIGI '!M24,LISTAS!$A$173:$B$174,2,0)","v":{"$error":"#N/A"}},{"$f":"+'FORMULACIÓN SIGI '!N24","v":0},{"$f":"+'FORMULACIÓN SIGI '!O24","v":0},{"$f":"+'FORMULACIÓN SIGI '!P24","v":"00:00:00"},{"$f":"+'FORMULACIÓN SIGI '!Q24","v":"00:00:00"},{"$f":"+'FORMULACIÓN SIGI '!R24","v":0}]
[{"$f":"VLOOKUP('FORMULACIÓN SIGI '!A25,LISTAS!$A$58:$B$59,2,0)","v":{"$error":"#N/A"}},{"$f":"VLOOKUP('FORMULACIÓN SIGI '!B25,LISTAS!$A$61:$B$65,2,0)","v":{"$error":"#N/A"}},{"$f":"VLOOKUP('FORMULACIÓN SIGI '!C25,LISTAS!$A$67:$B$74,2,0)","v":{"$error":"#N/A"}},{"$f":"VLOOKUP('FORMULACIÓN SIGI '!D25,LISTAS!$A$76:$B$82,2,0)","v":{"$error":"#N/A"}},{"$f":"VLOOKUP('FORMULACIÓN SIGI '!E25,LISTAS!$A$84:$B$91,2,0)","v":{"$error":"#N/A"}},{"$f":"VLOOKUP('FORMULACIÓN SIGI '!F25,LISTAS!$A$93:$B$145,2,0)","v":{"$error":"#N/A"}},{"$f":"VLOOKUP('FORMULACIÓN SIGI '!G25,LISTAS!$A$113:B129,2,0)","v":{"$error":"#N/A"}},{"$f":"VLOOKUP('FORMULACIÓN SIGI '!H25,LISTAS!$A$126:$B$145,2,0)","v":{"$error":"#N/A"}},{"$f":"VLOOKUP('FORMULACIÓN SIGI '!I25,LISTAS!$A$147:$B$171,2,0)","v":{"$error":"#N/A"}},{"$f":"+'FORMULACIÓN SIGI '!J25","v":0},{"$f":"+'FORMULACIÓN SIGI '!K25","v":0},{"$f":"+'FORMULACIÓN SIGI '!L25","v":0},{"$f":"VLOOKUP('FORMULACIÓN SIGI '!M25,LISTAS!$A$173:$B$174,2,0)","v":{"$error":"#N/A"}},{"$f":"+'FORMULACIÓN SIGI '!N25","v":0},{"$f":"+'FORMULACIÓN SIGI '!O25","v":0},{"$f":"+'FORMULACIÓN SIGI '!P25","v":"00:00:00"},{"$f":"+'FORMULACIÓN SIGI '!Q25","v":"00:00:00"},{"$f":"+'FORMULACIÓN SIGI '!R25","v":0}]
[{"$f":"VLOOKUP('FORMULACIÓN SIGI '!A26,LISTAS!$A$58:$B$59,2,0)","v":{"$error":"#N/A"}},{"$f":"VLOOKUP('FORMULACIÓN SIGI '!B26,LISTAS!$A$61:$B$65,2,0)","v":{"$error":"#N/A"}},{"$f":"VLOOKUP('FORMULACIÓN SIGI '!C26,LISTAS!$A$67:$B$74,2,0)","v":{"$error":"#N/A"}},{"$f":"VLOOKUP('FORMULACIÓN SIGI '!D26,LISTAS!$A$76:$B$82,2,0)","v":{"$error":"#N/A"}},{"$f":"VLOOKUP('FORMULACIÓN SIGI '!E26,LISTAS!$A$84:$B$91,2,0)","v":{"$error":"#N/A"}},{"$f":"VLOOKUP('FORMULACIÓN SIGI '!F26,LISTAS!$A$93:$B$145,2,0)","v":{"$error":"#N/A"}},{"$f":"VLOOKUP('FORMULACIÓN SIGI '!G26,LISTAS!$A$113:B130,2,0)","v":{"$error":"#N/A"}},{"$f":"VLOOKUP('FORMULACIÓN SIGI '!H26,LISTAS!$A$126:$B$145,2,0)","v":{"$error":"#N/A"}},{"$f":"VLOOKUP('FORMULACIÓN SIGI '!I26,LISTAS!$A$147:$B$171,2,0)","v":{"$error":"#N/A"}},{"$f":"+'FORMULACIÓN SIGI '!J26","v":0},{"$f":"+'FORMULACIÓN SIGI '!K26","v":0},{"$f":"+'FORMULACIÓN SIGI '!L26","v":0},{"$f":"VLOOKUP('FORMULACIÓN SIGI '!M26,LISTAS!$A$173:$B$174,2,0)","v":{"$error":"#N/A"}},{"$f":"+'FORMULACIÓN SIGI '!N26","v":0},{"$f":"+'FORMULACIÓN SIGI '!O26","v":0},{"$f":"+'FORMULACIÓN SIGI '!P26","v":"00:00:00"},{"$f":"+'FORMULACIÓN SIGI '!Q26","v":"00:00:00"},{"$f":"+'FORMULACIÓN SIGI '!R26","v":0}]
[{"$f":"VLOOKUP('FORMULACIÓN SIGI '!A27,LISTAS!$A$58:$B$59,2,0)","v":{"$error":"#N/A"}},{"$f":"VLOOKUP('FORMULACIÓN SIGI '!B27,LISTAS!$A$61:$B$65,2,0)","v":{"$error":"#N/A"}},{"$f":"VLOOKUP('FORMULACIÓN SIGI '!C27,LISTAS!$A$67:$B$74,2,0)","v":{"$error":"#N/A"}},{"$f":"VLOOKUP('FORMULACIÓN SIGI '!D27,LISTAS!$A$76:$B$82,2,0)","v":{"$error":"#N/A"}},{"$f":"VLOOKUP('FORMULACIÓN SIGI '!E27,LISTAS!$A$84:$B$91,2,0)","v":{"$error":"#N/A"}},{"$f":"VLOOKUP('FORMULACIÓN SIGI '!F27,LISTAS!$A$93:$B$145,2,0)","v":{"$error":"#N/A"}},{"$f":"VLOOKUP('FORMULACIÓN SIGI '!G27,LISTAS!$A$113:B131,2,0)","v":{"$error":"#N/A"}},{"$f":"VLOOKUP('FORMULACIÓN SIGI '!H27,LISTAS!$A$126:$B$145,2,0)","v":{"$error":"#N/A"}},{"$f":"VLOOKUP('FORMULACIÓN SIGI '!I27,LISTAS!$A$147:$B$171,2,0)","v":{"$error":"#N/A"}},{"$f":"+'FORMULACIÓN SIGI '!J27","v":0},{"$f":"+'FORMULACIÓN SIGI '!K27","v":0},{"$f":"+'FORMULACIÓN SIGI '!L27","v":0},{"$f":"VLOOKUP('FORMULACIÓN SIGI '!M27,LISTAS!$A$173:$B$174,2,0)","v":{"$error":"#N/A"}},{"$f":"+'FORMULACIÓN SIGI '!N27","v":0},{"$f":"+'FORMULACIÓN SIGI '!O27","v":0},{"$f":"+'FORMULACIÓN SIGI '!P27","v":"00:00:00"},{"$f":"+'FORMULACIÓN SIGI '!Q27","v":"00:00:00"},{"$f":"+'FORMULACIÓN SIGI '!R27","v":0}]
[{"$f":"VLOOKUP('FORMULACIÓN SIGI '!A28,LISTAS!$A$58:$B$59,2,0)","v":{"$error":"#N/A"}},{"$f":"VLOOKUP('FORMULACIÓN SIGI '!B28,LISTAS!$A$61:$B$65,2,0)","v":{"$error":"#N/A"}},{"$f":"VLOOKUP('FORMULACIÓN SIGI '!C28,LISTAS!$A$67:$B$74,2,0)","v":{"$error":"#N/A"}},{"$f":"VLOOKUP('FORMULACIÓN SIGI '!D28,LISTAS!$A$76:$B$82,2,0)","v":{"$error":"#N/A"}},{"$f":"VLOOKUP('FORMULACIÓN SIGI '!E28,LISTAS!$A$84:$B$91,2,0)","v":{"$error":"#N/A"}},{"$f":"VLOOKUP('FORMULACIÓN SIGI '!F28,LISTAS!$A$93:$B$145,2,0)","v":{"$error":"#N/A"}},{"$f":"VLOOKUP('FORMULACIÓN SIGI '!G28,LISTAS!$A$113:B132,2,0)","v":{"$error":"#N/A"}},{"$f":"VLOOKUP('FORMULACIÓN SIGI '!H28,LISTAS!$A$126:$B$145,2,0)","v":{"$error":"#N/A"}},{"$f":"VLOOKUP('FORMULACIÓN SIGI '!I28,LISTAS!$A$147:$B$171,2,0)","v":{"$error":"#N/A"}},{"$f":"+'FORMULACIÓN SIGI '!J28","v":0},{"$f":"+'FORMULACIÓN SIGI '!K28","v":0},{"$f":"+'FORMULACIÓN SIGI '!L28","v":0},{"$f":"VLOOKUP('FORMULACIÓN SIGI '!M28,LISTAS!$A$173:$B$174,2,0)","v":{"$error":"#N/A"}},{"$f":"+'FORMULACIÓN SIGI '!N28","v":0},{"$f":"+'FORMULACIÓN SIGI '!O28","v":0},{"$f":"+'FORMULACIÓN SIGI '!P28","v":"00:00:00"},{"$f":"+'FORMULACIÓN SIGI '!Q28","v":"00:00:00"},{"$f":"+'FORMULACIÓN SIGI '!R28","v":0}]
[{"$f":"VLOOKUP('FORMULACIÓN SIGI '!A29,LISTAS!$A$58:$B$59,2,0)","v":{"$error":"#N/A"}},{"$f":"VLOOKUP('FORMULACIÓN SIGI '!B29,LISTAS!$A$61:$B$65,2,0)","v":{"$error":"#N/A"}},{"$f":"VLOOKUP('FORMULACIÓN SIGI '!C29,LISTAS!$A$67:$B$74,2,0)","v":{"$error":"#N/A"}},{"$f":"VLOOKUP('FORMULACIÓN SIGI '!D29,LISTAS!$A$76:$B$82,2,0)","v":{"$error":"#N/A"}},{"$f":"VLOOKUP('FORMULACIÓN SIGI '!E29,LISTAS!$A$84:$B$91,2,0)","v":{"$error":"#N/A"}},{"$f":"VLOOKUP('FORMULACIÓN SIGI '!F29,LISTAS!$A$93:$B$145,2,0)","v":{"$error":"#N/A"}},{"$f":"VLOOKUP('FORMULACIÓN SIGI '!G29,LISTAS!$A$113:B133,2,0)","v":{"$error":"#N/A"}},{"$f":"VLOOKUP('FORMULACIÓN SIGI '!H29,LISTAS!$A$126:$B$145,2,0)","v":{"$error":"#N/A"}},{"$f":"VLOOKUP('FORMULACIÓN SIGI '!I29,LISTAS!$A$147:$B$171,2,0)","v":{"$error":"#N/A"}},{"$f":"+'FORMULACIÓN SIGI '!J29","v":0},{"$f":"+'FORMULACIÓN SIGI '!K29","v":0},{"$f":"+'FORMULACIÓN SIGI '!L29","v":0},{"$f":"VLOOKUP('FORMULACIÓN SIGI '!M29,LISTAS!$A$173:$B$174,2,0)","v":{"$error":"#N/A"}},{"$f":"+'FORMULACIÓN SIGI '!N29","v":0},{"$f":"+'FORMULACIÓN SIGI '!O29","v":0},{"$f":"+'FORMULACIÓN SIGI '!P29","v":"00:00:00"},{"$f":"+'FORMULACIÓN SIGI '!Q29","v":"00:00:00"},{"$f":"+'FORMULACIÓN SIGI '!R29","v":0}]
[{"$f":"VLOOKUP('FORMULACIÓN SIGI '!A30,LISTAS!$A$58:$B$59,2,0)","v":{"$error":"#N/A"}},{"$f":"VLOOKUP('FORMULACIÓN SIGI '!B30,LISTAS!$A$61:$B$65,2,0)","v":{"$error":"#N/A"}},{"$f":"VLOOKUP('FORMULACIÓN SIGI '!C30,LISTAS!$A$67:$B$74,2,0)","v":{"$error":"#N/A"}},{"$f":"VLOOKUP('FORMULACIÓN SIGI '!D30,LISTAS!$A$76:$B$82,2,0)","v":{"$error":"#N/A"}},{"$f":"VLOOKUP('FORMULACIÓN SIGI '!E30,LISTAS!$A$84:$B$91,2,0)","v":{"$error":"#N/A"}},{"$f":"VLOOKUP('FORMULACIÓN SIGI '!F30,LISTAS!$A$93:$B$145,2,0)","v":{"$error":"#N/A"}},{"$f":"VLOOKUP('FORMULACIÓN SIGI '!G30,LISTAS!$A$113:B134,2,0)","v":{"$error":"#N/A"}},{"$f":"VLOOKUP('FORMULACIÓN SIGI '!H30,LISTAS!$A$126:$B$145,2,0)","v":{"$error":"#N/A"}},{"$f":"VLOOKUP('FORMULACIÓN SIGI '!I30,LISTAS!$A$147:$B$171,2,0)","v":{"$error":"#N/A"}},{"$f":"+'FORMULACIÓN SIGI '!J30","v":0},{"$f":"+'FORMULACIÓN SIGI '!K30","v":0},{"$f":"+'FORMULACIÓN SIGI '!L30","v":0},{"$f":"VLOOKUP('FORMULACIÓN SIGI '!M30,LISTAS!$A$173:$B$174,2,0)","v":{"$error":"#N/A"}},{"$f":"+'FORMULACIÓN SIGI '!N30","v":0},{"$f":"+'FORMULACIÓN SIGI '!O30","v":0},{"$f":"+'FORMULACIÓN SIGI '!P30","v":"00:00:00"},{"$f":"+'FORMULACIÓN SIGI '!Q30","v":"00:00:00"},{"$f":"+'FORMULACIÓN SIGI '!R30","v":0}]
[{"$f":"VLOOKUP('FORMULACIÓN SIGI '!A31,LISTAS!$A$58:$B$59,2,0)","v":{"$error":"#N/A"}},{"$f":"VLOOKUP('FORMULACIÓN SIGI '!B31,LISTAS!$A$61:$B$65,2,0)","v":{"$error":"#N/A"}},{"$f":"VLOOKUP('FORMULACIÓN SIGI '!C31,LISTAS!$A$67:$B$74,2,0)","v":{"$error":"#N/A"}},{"$f":"VLOOKUP('FORMULACIÓN SIGI '!D31,LISTAS!$A$76:$B$82,2,0)","v":{"$error":"#N/A"}},{"$f":"VLOOKUP('FORMULACIÓN SIGI '!E31,LISTAS!$A$84:$B$91,2,0)","v":{"$error":"#N/A"}},{"$f":"VLOOKUP('FORMULACIÓN SIGI '!F31,LISTAS!$A$93:$B$145,2,0)","v":{"$error":"#N/A"}},{"$f":"VLOOKUP('FORMULACIÓN SIGI '!G31,LISTAS!$A$113:B135,2,0)","v":{"$error":"#N/A"}},{"$f":"VLOOKUP('FORMULACIÓN SIGI '!H31,LISTAS!$A$126:$B$145,2,0)","v":{"$error":"#N/A"}},{"$f":"VLOOKUP('FORMULACIÓN SIGI '!I31,LISTAS!$A$147:$B$171,2,0)","v":{"$error":"#N/A"}},{"$f":"+'FORMULACIÓN SIGI '!J31","v":0},{"$f":"+'FORMULACIÓN SIGI '!K31","v":0},{"$f":"+'FORMULACIÓN SIGI '!L31","v":0},{"$f":"VLOOKUP('FORMULACIÓN SIGI '!M31,LISTAS!$A$173:$B$174,2,0)","v":{"$error":"#N/A"}},{"$f":"+'FORMULACIÓN SIGI '!N31","v":0},{"$f":"+'FORMULACIÓN SIGI '!O31","v":0},{"$f":"+'FORMULACIÓN SIGI '!P31","v":"00:00:00"},{"$f":"+'FORMULACIÓN SIGI '!Q31","v":"00:00:00"},{"$f":"+'FORMULACIÓN SIGI '!R31","v":0}]
[{"$f":"VLOOKUP('FORMULACIÓN SIGI '!A32,LISTAS!$A$58:$B$59,2,0)","v":{"$error":"#N/A"}},{"$f":"VLOOKUP('FORMULACIÓN SIGI '!B32,LISTAS!$A$61:$B$65,2,0)","v":{"$error":"#N/A"}},{"$f":"VLOOKUP('FORMULACIÓN SIGI '!C32,LISTAS!$A$67:$B$74,2,0)","v":{"$error":"#N/A"}},{"$f":"VLOOKUP('FORMULACIÓN SIGI '!D32,LISTAS!$A$76:$B$82,2,0)","v":{"$error":"#N/A"}},{"$f":"VLOOKUP('FORMULACIÓN SIGI '!E32,LISTAS!$A$84:$B$91,2,0)","v":{"$error":"#N/A"}},{"$f":"VLOOKUP('FORMULACIÓN SIGI '!F32,LISTAS!$A$93:$B$145,2,0)","v":{"$error":"#N/A"}},{"$f":"VLOOKUP('FORMULACIÓN SIGI '!G32,LISTAS!$A$113:B136,2,0)","v":{"$error":"#N/A"}},{"$f":"VLOOKUP('FORMULACIÓN SIGI '!H32,LISTAS!$A$126:$B$145,2,0)","v":{"$error":"#N/A"}},{"$f":"VLOOKUP('FORMULACIÓN SIGI '!I32,LISTAS!$A$147:$B$171,2,0)","v":{"$error":"#N/A"}},{"$f":"+'FORMULACIÓN SIGI '!J32","v":0},{"$f":"+'FORMULACIÓN SIGI '!K32","v":0},{"$f":"+'FORMULACIÓN SIGI '!L32","v":0},{"$f":"VLOOKUP('FORMULACIÓN SIGI '!M32,LISTAS!$A$173:$B$174,2,0)","v":{"$error":"#N/A"}},{"$f":"+'FORMULACIÓN SIGI '!N32","v":0},{"$f":"+'FORMULACIÓN SIGI '!O32","v":0},{"$f":"+'FORMULACIÓN SIGI '!P32","v":"00:00:00"},{"$f":"+'FORMULACIÓN SIGI '!Q32","v":"00:00:00"},{"$f":"+'FORMULACIÓN SIGI '!R32","v":0}]
{"$rows_left_out":188}
{"sheet":"LISTAS","index":2,"n_rows":208,"n_cols":15,"rows_kept":208,"cut":false,"hidden":true,"merged":[[11,0,11,2]]}
["Oficina Asesora Jurídica","Oficina de Control Interno","Oficina Asesora de Planeación","Oficina de Servicios al Consumidor y de Apoyo Empresarial","Oficina de Tecnología e Informática","Secretaría General","Delegatura para la protección del Consumidor","Delegatura para la Protección de Datos","Delegatura para el Control y Verificación de Reglamentos Técnicos y Metrología Legal  ","Delegatura para Asuntos  Jurisdiccionales","Delegatura para la Propiedad Industrial","Delegatura para la Protección de la Competencia"]
["Grupo de Trabajo Cobro Coactivo",null,"Grupo de Trabajo de Estudios Económicos","Grupo de Atención al Ciudadano",null,"Grupo de Trabajo de Administración de Personal","Grupo de trabajo de Apoyo a la Red Nacional de Protección al Consumidor","Dirección de Investigaciones ",null,null,"Grupo de Trabajo de Vía Gubernativa "]
["Grupo de Trabajo Gestión Judicial",null,"Grupo de Trabajo de Asuntos Internacionales","Grupo de Formación",null,"Grupo de Trabajo de Desarrollo del Talento Humano","Dirección de Investigaciones de Protección al Consumidor      ","Dirección Habeas Data",null,null,"Grupo de Trabajo de Centro de Información Tecnológica y Apoyo a la Gestión de Propiedad Industrial - CIGEPI"]
["Grupo de Trabajo de Regulación",null,null,"Grupo de Comunicación",null,"Grupo de Trabajo de Control Disciplinario Interno","Dirección de Investigaciones de Protección de Usuarios de Servicios de Comunicaciones ",null,null,null,"Dirección de Signos Distintivos"]
[null,null,null,null,null,"Grupo de Trabajo de Notificaciones y Certificaciones",null,null,null,null,"Dirección de  Nuevas Creaciones"]
[null,null,null,null,null,"Grupo de Trabajo de Gestión Documental y Archivo"]
[null,null,null,null,null,"Grupo de Trabajo de Servicios Administrativos y Recursos Físicos"]
[null,null,null,null,null,"Grupo de Trabajo  Contratación"]
[null,null,null,null,null,"Dirección  Financiera"]
["GRUP_O1","GRUPO2","GRUP_O3","GRUPO4","GRUPO5","GRUPO6","GRUPO7","GRUPO_8","GRUPO9","GRUPO10","GRUPO11","GRUPO12"]
[]
["Fórmula para generación de rangos:",null,null,{"$f":"+HLOOKUP('[2]FORMULACIÓN '!$N$6,[2]LISTAS!A1:L10,10,0)","v":"GRUPO8"}]
[null,null,null,null,null,null,null,null,null,null,null,null,null,null,"Delegatura para Asuntos  Jurisdiccionales"]
["DEPENDENCIAS","código",null,null,null,null,null,null,null,null,null,null,null,null,"Delegatura para la Propiedad Industrial"]
["Oficina Asesora Jurídica",10,null,{"$f":"+CONCATENATE(B15,\" \",A15)","v":"10 Oficina Asesora Jurídica"},null,null,null,null,null,null,null,null,null,null,"Delegatura para la Protección de la Competencia"]
{"$rows_left_out":193}