{"text_format":"1","workbook":"xlsx","n_sheets":3,"sheets":["EDICIÓN","CONFIGURACIÓN_PARTICIPANTES","LISTAS"],"not_rendered":{"charts":0,"images":7,"macros":1,"external_links":1,"defined_names":37,"comments":0,"pivot_tables":0},"unopened":[],"bounds":{"document_bytes":16777216,"sheet_cells":100000,"rows_first":2000,"rows_last":500,"rows_between":2000,"halvings":0,"cell_chars":16384,"cell_head_chars":4096},"cells_cut":0,"cells_raw":0,"read":"whole","date_system":"1900"}

{"sheet":"EDICIÓN","index":0,"n_rows":253,"n_cols":23,"rows_kept":253,"cut":false,"hidden":false,"merged":[[15,17,15,18],[16,17,16,18],[17,17,17,18],[18,17,18,18],[1,1,2,20],[16,12,18,12],[16,15,18,15],[4,1,4,2],[10,6,11,9],[10,1,11,4],[6,1,6,2],[6,3,6,8],[8,1,8,2],[8,3,8,9],[14,6,15,6],[14,7,15,9],[20,1,20,20],[10,11,10,15],[4,14,4,20],[6,14,6,20],[8,14,8,20],[11,13,11,14],[12,13,13,14],[14,13,15,14],[16,13,18,14],[10,17,10,20],[11,17,11,18],[12,17,12,18],[13,17,13,18],[14,17,14,18],[12,15,13,15],[14,15,15,15],[4,3,4,8],[14,12,15,12],[12,1,13,1],[12,2,13,4],[12,6,13,6],[12,7,13,9],[14,1,15,1],[14,2,15,4],[14,11,15,11],[12,12,13,12],[12,11,13,11],[4,11,4,13],[6,11,6,13],[8,11,8,13],[16,1,18,1],[16,2,18,4],[16,6,18,6],[16,7,18,9],[16,11,18,11]]}
[]
[null,"SOLICITUD DE MODIFICACIÓN  PLAN DE ACCIÓN "]
[]
[]
[null,"VIGENCIA:",null,null,null,null,null,null,null,null,null,"AREA:"]
[]
[null,"N° MODIFICACIÓN:",null,null,null,null,null,null,null,null,null,"ÁREA O DEPENDENCIA RESPONSABLE:"]
[]
[null,"FECHA:",null,null,null,null,null,null,null,null,null,"FICHA:",null,null,{"$f":"IF(ISERROR(VLOOKUP(O7,LISTAS!$A$15:$B$50,2,0)),\"\",VLOOKUP(O7,LISTAS!$A$15:$B$50,2,0))","v":""}]
[]
[null,"Vo.Bo. REVISIÓN OAP",null,null,null,null,"APROBACIÓN JEFE OFICINA DE PLANEACIÓN",null,null,null,null,"FIRMAS AREAS/DEPENDENCIAS  RESPONSABLES DE LA FICHA",null,null,null,null,null,"AUTORIZACION OTRAS DEPENDENCIAS RESPONSABLES DE LA EJECUCIÓN DE  ACTIVIDADES"]
[null,null,null,null,null,null,null,null,null,null,null,null," 1° Nivel","2° Nivel",null,"3° Nivel",null,"DEPENDENCIA",null,"NOMBRE ","FIRMA"]
[null,"Nombre:",null,null,null,null,"Nombre:",null,null,null,null,"Nombre:"]
[]
[null,"Firma:",null,null,null,null,"Firma:",null,null,null,null,"Firma:"]
[]
[null,"Cargo:",null,null,null,null,"FECHA Vo.Bo:",null,null,null,null,"Cargo:"]
[]
[]
[]
[null,"Diligencie cada una de las columnas del formato de acuerdo a la versión vigente del PAA, reemplace los contenidos de las celdas que desea modificar, identifíquelas con fondo de color amarillo y justifique los cambios en la columna \"U\". \nSi la modificación a realizar corresponde a los porcentajes de participación de áreas responsables diferentes a la formuladora, diríjase a la celda T22, \"Áreas/ Dependencias responsables de la ejecución de actividades\" y a través de clic en la imagen se habilitará un nuevo formato donde podrá realizar los ajustes requeridos  \n"]
[null,"Código ","Identificación  Fila","Categoría","Objetivo Estratégico","Indicador Estratégico","Estrategia","Insumo de planeación del que se extrajo el producto","¿Es producto compartido con otras áreas?","Fuente de Financiación","Política(s) MIPG","Asociación a planes ","Producto o Actividad","Part. %\n","Meta","Unidad de medida (Meta)","Fórmula para determinar % de Avance ","Fecha Inicio","Fecha Final","Áreas/\nDependencias responsables de la ejecución de actividaes","JUSTIFICACIÓN "]
[null,null,null,null,null,null,null,null,null,null,null,null,null,null,null,null,null,null,null,null,null,null,{"$f":"VLOOKUP(E23,LISTAS!$A$100:$B$111,2,0)","v":{"$error":"#N/A"}}]
[null,null,null,null,null,null,null,null,null,null,null,null,null,null,null,null,null,null,null,null,null,null,{"$f":"VLOOKUP(E24,LISTAS!$A$100:$B$111,2,0)","v":{"$error":"#N/A"}}]
[null,null,null,null,null,null,null,null,null,null,null,null,null,null,null,null,null,null,null,null,null,null,{"$f":"VLOOKUP(E25,LISTAS!$A$100:$B$111,2,0)","v":{"$error":"#N/A"}}]
[null,null,null,null,null,null,null,null,null,null,null,null,null,null,null,null,null,null,null,null,null,null,{"$f":"VLOOKUP(E26,LISTAS!$A$100:$B$111,2,0)","v":{"$error":"#N/A"}}]
[null,null,null,null,null,null,null,null,null,null,null,null,null,null,null,null,null,null,null,null,null,null,{"$f":"VLOOKUP(E27,LISTAS!$A$100:$B$111,2,0)","v":{"$error":"#N/A"}}]
[null,null,null,null,null,null,null,null,null,null,null,null,null,null,null,null,null,null,null,null,null,null,{"$f":"VLOOKUP(E28,LISTAS!$A$100:$B$111,2,0)","v":{"$error":"#N/A"}}]
[null,null,null,null,null,null,null,null,null,null,null,null,null,null,null,null,null,null,null,null,null,null,{"$f":"VLOOKUP(E29,LISTAS!$A$100:$B$111,2,0)","v":{"$error":"#N/A"}}]
[null,null,null,null,null,null,null,null,null,null,null,null,null,null,null,null,null,null,null,null,null,null,{"$f":"VLOOKUP(E30,LISTAS!$A$100:$B$111,2,0)","v":{"$error":"#N/A"}}]
[null,null,null,null,null,null,null,null,null,null,null,null,null,null,null,null,null,null,null,null,null,null,{"$f":"VLOOKUP(E31,LISTAS!$A$100:$B$111,2,0)","v":{"$error":"#N/A"}}]
[null,null,null,null,null,null,null,null,null,null,null,null,null,null,null,null,null,null,null,null,null,null,{"$f":"VLOOKUP(E32,LISTAS!$A$100:$B$111,2,0)","v":{"$error":"#N/A"}}]
[null,null,null,null,null,null,null,null,null,null,null,null,null,null,null,null,null,null,null,null,null,null,{"$f":"VLOOKUP(E33,LISTAS!$A$100:$B$111,2,0)","v":{"$error":"#N/A"}}]
[null,null,null,null,null,null,null,null,null,null,null,null,null,null,null,null,null,null,null,null,null,null,{"$f":"VLOOKUP(E34,LISTAS!$A$100:$B$111,2,0)","v":{"$error":"#N/A"}}]
[null,null,null,null,null,null,null,null,null,null,null,null,null,null,null,null,null,null,null,null,null,null,{"$f":"VLOOKUP(E35,LISTAS!$A$100:$B$111,2,0)","v":{"$error":"#N/A"}}]
[null,null,null,null,null,null,null,null,null,null,null,null,null,null,null,null,null,null,null,null,null,null,{"$f":"VLOOKUP(E36,LISTAS!$A$100:$B$111,2,0)","v":{"$error":"#N/A"}}]
[null,null,null,null,null,null,null,null,null,null,null,null,null,null,null,null,null,null,null,null,null,null,{"$f":"VLOOKUP(E37,LISTAS!$A$100:$B$111,2,0)","v":{"$error":"#N/A"}}]
[null,null,null,null,null,null,null,null,null,null,null,null,null,null,null,null,null,null,null,null,null,null,{"$f":"VLOOKUP(E38,LISTAS!$A$100:$B$111,2,0)","v":{"$error":"#N/A"}}]
[null,null,null,null,null,null,null,null,null,null,null,null,null,null,null,null,null,null,null,null,null,null,{"$f":"VLOOKUP(E39,LISTAS!$A$100:$B$111,2,0)","v":{"$error":"#N/A"}}]
[null,null,null,null,null,null,null,null,null,null,null,null,null,null,null,null,null,null,null,null,null,null,{"$f":"VLOOKUP(E40,LISTAS!$A$100:$B$111,2,0)","v":{"$error":"#N/A"}}]
{"$rows_left_out":214}
{"sheet":"CONFIGURACIÓN_PARTICIPANTES","index":1,"n_rows":302,"n_cols":36,"rows_kept":302,"cut":false,"hidden":true,"merged":[[1,1,2,18],[4,7,4,9],[4,3,4,5]]}
[]
[null,"CONFIGURACIÓN PORCENTAJES DE PARTICIPACIÓN ÁREAS RESPONSABLES DE EJECUCIÓN DE ACTIVIADES"]
[]
[]
[null,null,null,"Pique en la imágen  para actualizar la información registrada en la hoja de edición.",null,null,null,"Pique en la imagen para borrar información copiada de la hoja de edición y los datos por usted registrados \nen las columnas \"Part. %\"."]
[]
[null,"Código ","Identificación  Fila","Producto o Actividad","Áreas/\nDependencias responsables de la ejecución de actividaes","Área/Dep 1 ","Part.  % Act.\nÁrea/Dep 1","Área/Dep 2","Part.  % Act.\nÁrea/Dep 2 ","Área/Dep 3","Part.  % Act.\nÁrea/Dep 3 ","Área/Dep 4","Part.  % Act.\nÁrea/Dep 4 ","Área/Dep 5","Part.  % Act.\nÁrea/Dep 5 ","Área/Dep 6","Part.  % Act.\nÁrea/Dep 6 ","Área/Dep 7","Part.  % Act.\nÁrea/Dep 7 ",null,"Área/Dep 1 ","Área/Dep 2","Área/Dep 3","Área/Dep 4","Área/Dep 5","Área/Dep 6","Área/Dep 7",null,"Áreas/","Área/Dep 2","Área/Dep 3","Área/Dep 4","Área/Dep 5","Área/Dep 6","Área/Dep 7"]
[null,null,null,null,null,{"$f":"IF($C8=\"Producto \",\"N/A\",U8)","v":""},null,{"$f":"IF($C8=\"Producto \",\"N/A\",V8)","v":""},null,{"$f":"IF($C8=\"Producto \",\"N/A\",W8)","v":""},null,{"$f":"IF($C8=\"Producto \",\"N/A\",X8)","v":""},null,{"$f":"IF($C8=\"Producto \",\"N/A\",Y8)","v":""},null,{"$f":"IF($C8=\"Producto \",\"N/A\",Z8)","v":""},null,{"$f":"IF($C8=\"Producto \",\"N/A\",AA8)","v":""},null,null,{"$f":"IF(AC8=\"\",\"\",AC8)","v":""},{"$f":"IF(AD8=\"\",\"\",AD8)","v":""},"","","","",""]
[null,null,null,null,null,{"$f":"IF($C9=\"Producto \",\"N/A\",U9)","v":""},null,{"$f":"IF($C9=\"Producto \",\"N/A\",V9)","v":""},null,{"$f":"IF($C9=\"Producto \",\"N/A\",W9)","v":""},null,{"$f":"IF($C9=\"Producto \",\"N/A\",X9)","v":""},null,{"$f":"IF($C9=\"Producto \",\"N/A\",Y9)","v":""},null,{"$f":"IF($C9=\"Producto \",\"N/A\",Z9)","v":""},null,{"$f":"IF($C9=\"Producto \",\"N/A\",AA9)","v":""},null,null,{"$f":"IF(AC9=\"\",\"\",AC9)","v":""},{"$f":"IF(AD9=\"\",\"\",AD9)","v":""},{"$f":"IF(AE9=\"\",\"\",AE9)","v":""},{"$f":"IF(AF9=\"\",\"\",AF9)","v":""},{"$f":"IF(AG9=\"\",\"\",AG9)","v":""},{"$f":"IF(AH9=\"\",\"\",AH9)","v":""},{"$f":"IF(AI9=\"\",\"\",AI9)","v":""},null,null,null,null,null,null,null,null," »1000-Delegatura para la Protección de la Competencia"]
[null,null,null,null,null,"",null,"",null,"",null,"",null,"",null,"",null,"",null,null,"","","","","","",""]
[null,null,null,null,null,"",null,"",null,"",null,"",null,"",null,"",null,"",null,null,"","","","","","",""]
[null,null,null,null,null,"",null,"",null,"",null,"",null,"",null,"",null,"",null,null,"","","","","","",""]
[null,null,null,null,null,"",null,"",null,"",null,"",null,"",null,"",null,"",null,null,"","","","","","",""]
[null,null,null,null,null,"",null,"",null,"",null,"",null,"",null,"",null,"",null,null,"","","","","","",""]
[null,null,null,null,null,"",null,"",null,"",null,"",null,"",null,"",null,"",null,null,"","","","","","",""]
[null,null,null,null,null,"",null,"",null,"",null,"",null,"",null,"",null,"",null,null,"","","","","","",""]
[null,null,null,null,null,"",null,"",null,"",null,"",null,"",null,"",null,"",null,null,"","","","","","",""]
[null,null,null,null,null,"",null,"",null,"",null,"",null,"",null,"",null,"",null,null,"","","","","","",""]
[null,null,null,null,null,"",null,"",null,"",null,"",null,"",null,"",null,"",null,null,"","","","","","",""]
[null,null,null,null,null,"",null,"",null,"",null,"",null,"",null,"",null,"",null,null,"","","","","","",""]
[null,null,null,null,null,"",null,"",null,"",null,"",null,"",null,"",null,"",null,null,"","","","","","",""]
[null,null,null,null,null,"",null,"",null,"",null,"",null,"",null,"",null,"",null,null,"","","","","","",""]
[null,null,null,null,null,"",null,"",null,"",null,"",null,"",null,"",null,"",null,null,"","","","","","",""]
[null,null,null,null,null,"",null,"",null,"",null,"",null,"",null,"",null,"",null,null,"","","","","","",""]
[null,null,null,null,null,"",null,"",null,"",null,"",null,"",null,"",null,"",null,null,"","","","","","",""]
[null,null,null,null,null,"",null,"",null,"",null,"",null,"",null,"",null,"",null,null,"","","","","","",""]
[null,null,null,null,null,"",null,"",null,"",null,"",null,"",null,"",null,"",null,null,"","","","","","",""]
[null,null,null,null,null,"",null,"",null,"",null,"",null,"",null,"",null,"",null,null,"","","","","","",""]
[null,null,null,null,null,"",null,"",null,"",null,"",null,"",null,"",null,"",null,null,"","","","","","",""]
[null,null,null,null,null,"",null,"",null,"",null,"",null,"",null,"",null,"",null,null,"","","","","","",""]
[null,null,null,null,null,"",null,"",null,"",null,"",null,"",null,"",null,"",null,null,"","","","","","",""]
[null,null,null,null,null,"",null,"",null,"",null,"",null,"",null,"",null,"",null,null,"","","","","","",""]
[null,null,null,null,null,"",null,"",null,"",null,"",null,"",null,"",null,"",null,null,"","","","","","",""]
[null,null,null,null,null,"",null,"",null,"",null,"",null,"",null,"",null,"",null,null,"","","","","","",""]
[null,null,null,null,null,"",null,"",null,"",null,"",null,"",null,"",null,"",null,null,"","","","","","",""]
[null,null,null,null,null,"",null,"",null,"",null,"",null,"",null,"",null,"",null,null,"","","","","","",""]
[null,null,null,null,null,"",null,"",null,"",null,"",null,"",null,"",null,"",null,null,"","","","","","",""]
[null,null,null,null,null,"",null,"",null,"",null,"",null,"",null,"",null,"",null,null,"","","","","","",""]
[null,null,null,null,null,"",null,"",null,"",null,"",null,"",null,"",null,"",null,null,"","","","","","",""]
[null,null,null,null,null,"",null,"",null,"",null,"",null,"",null,"",null,"",null,null,"","","","","","",""]
{"$rows_left_out":263}
{"sheet":"LISTAS","index":2,"n_rows":264,"n_cols":16384,"rows_kept":264,"cut":false,"hidden":true,"merged":[[11,0,11,2]]}
["Oficina Asesora Jurídica","Oficina de Control Interno","Oficina Asesora de Planeación","Oficina de Servicios al Consumidor y de Apoyo Empresarial","Oficina de Tecnología e Informática","Secretaría General","Delegatura para la protección del Consumidor","Delegatura para la Protección de Datos","Delegatura para el Control y Verificación de Reglamentos Técnicos y Metrología Legal  ","Delegatura para Asuntos  Jurisdiccionales","Delegatura para la Propiedad Industrial","Delegatura para la Protección de la Competencia"]
["Grupo de Trabajo Cobro Coactivo",null,"Grupo de Trabajo de Estudios Económicos","Grupo de Atención al Ciudadano",null,"Grupo de Trabajo de Administración de Personal","Grupo de trabajo de Apoyo a la Red Nacional de Protección al Consumidor",null,null,null,"Grupo de Trabajo de Vía Gubernativa ","Dirección de Cámaras de Comercio"]
["Grupo de Trabajo Gestión Judicial",null,"Grupo de Trabajo de Asuntos Internacionales","Grupo de Formación",null,"Grupo de Trabajo de Desarrollo del Talento Humano","Dirección de Investigaciones de Protección al Consumidor      ",null,null,null,"Grupo de Trabajo de Centro de Información Tecnológica y Apoyo a la Gestión de Propiedad Industrial - CIGEPI"]
["Grupo de Trabajo de Regulación",null,null,"Grupo de Comunicación",null,"Grupo de Trabajo de Control Disciplinario Interno","Dirección de Investigaciones de Protección de Usuarios de Servicios de Comunicaciones ",null,null,null,"Dirección de Signos Distintivos"]
[null,null,null,null,null,"Grupo de Trabajo de Notificaciones y Certificaciones",null,null,null,null,"Dirección de  Nuevas Creaciones"]
[null,null,null,null,null,"Grupo de Trabajo de Gestión Documental y Archivo"]
[null,null,null,null,null,"Grupo de Trabajo de Servicios Administrativos y Recursos Físicos"]
[null,null,null,null,null,"Grupo de Trabajo  Contratación"]
[null,null,null,null,null,"Dirección  Financiera"]
["GRUPO1","GRUPO2","GRUPO3","GRUPO4","GRUPO5","GRUPO6","GRUPO7","GRUPO8","GRUPO9","GRUPO10","GRUPO11","GRUPO12"]
[]
["Fórmula para generación de rangos:",null,null,{"$f":"+HLOOKUP(EDICIÓN!$O$5,LISTAS!A1:L10,10,0)","v":{"$error":"#N/A"}}]
[]
["DEPENDENCIAS","código"]
["Oficina Asesora Jurídica",10]
["Grupo de Trabajo Cobro Coactivo",11]
["Gestión de Trabajo Gestión Judicial",60]
["Grupo de Trabajo de Regulación",12]
["Oficina de Control Interno",50]
["Oficina Asesora de Planeación",30]
["Grupo de Trabajo de Estudios Económicos",37]
["Grupo de Trabajo de Asuntos Internacionales",38]
["Oficina de Servicios al Consumidor y de Apoyo Empresarial",70]
["Grupo de Atención al Ciudadano",72]
["Grupo de Formación",71]
["Grupo de Comunicación",73]
["Oficina de Tecnología e Informática",20]
["Secretaría General",100]
["Grupo de Trabajo de Administración de Personal",111]
["Grupo de Trabajo de Desarrollo del Talento Humano",117]
["Grupo de Trabajo de Control Disciplinario Interno",103]
["Grupo de Trabajo de Notificaciones y Certificaciones",104]
["Grupo de Trabajo de Gestión Documental y Archivo",141]
["Grupo de Trabajo de Servicios Administrativos y Recursos Físicos",142]
["Grupo de Trabajo  Contratación",105]
["Dirección  Financiera",130]
["Delegatura para la protección del Consumidor",3000]
["Grupo de trabajo de Apoyo a la Red Nacional de Protección al Consumidor",3003]
["Dirección de Investigaciones de Protección al Consumidor      ",3100]
["Dirección de Investigaciones de Protección de Usuarios de Servicios de Comunicaciones ",3200]
{"$rows_left_out":224}