{"text_format":"1","workbook":"xlsx","n_sheets":9,"sheets":["DATOS 0 ","RT03-F61","Interpol TH","Incertidumbre","interpolación pat","Interpolación hor ","RT03-F61.","RT03-F63","RT03-F64"],"not_rendered":{"charts":8,"images":6,"macros":1,"external_links":6,"defined_names":199,"comments":6,"pivot_tables":0},"unopened":[],"bounds":{"document_bytes":16777216,"sheet_cells":100000,"rows_first":2000,"rows_last":500,"rows_between":2000,"halvings":0,"cell_chars":16384,"cell_head_chars":4096},"cells_cut":0,"cells_raw":0,"read":"whole","date_system":"1900"}

{"sheet":"DATOS 0 ","index":0,"n_rows":66,"n_cols":17,"rows_kept":66,"cut":false,"hidden":true,"merged":[[48,8,50,8],[51,8,53,8],[65,2,66,2],[42,8,44,8],[45,8,47,8],[33,1,33,3],[29,1,29,3],[29,4,29,8],[29,12,29,16],[33,12,33,16],[34,1,34,3],[34,12,34,16],[35,1,35,3],[35,12,35,16],[33,4,33,8],[34,4,34,8],[35,4,35,8],[30,1,30,3],[30,4,30,8],[30,12,30,16],[31,1,31,3],[31,4,31,8],[31,12,31,16],[32,1,32,3],[17,1,17,3],[17,4,17,8],[4,1,4,3],[4,4,4,8],[5,1,5,3],[5,4,5,8],[6,1,6,3],[6,4,6,8],[7,1,7,3],[7,4,7,8],[16,1,16,16],[17,12,17,16],[12,12,12,13],[12,14,12,16],[13,1,13,3],[13,4,13,8],[13,12,13,13],[13,14,13,16],[14,1,14,3],[14,4,14,8],[14,9,14,16],[12,1,12,3],[12,4,12,8],[25,1,25,3],[25,4,25,8],[25,12,25,16],[26,1,26,3],[26,4,26,8],[26,12,26,16],[25,9,25,11],[26,9,26,11],[27,12,27,16],[18,4,18,8],[18,12,18,16],[19,1,19,3],[19,4,19,8],[23,12,23,16],[24,1,24,3],[24,5,24,6],[24,12,24,13],[23,9,23,11],[20,1,20,3],[20,4,20,8],[21,1,21,3],[21,4,21,8],[23,1,23,3],[23,4,23,8],[21,12,21,16],[22,1,22,3],[22,4,22,8],[22,12,22,16],[21,9,21,11],[22,9,22,11],[32,12,32,13],[33,9,33,11],[34,9,34,11],[35,9,35,11],[27,9,27,11],[27,1,27,3],[27,4,27,8],[28,1,28,3],[28,4,28,8],[28,9,28,11],[28,12,28,16],[36,1,36,3],[36,12,36,16],[37,1,37,3],[37,12,37,16],[38,1,38,3],[38,12,38,16],[36,9,36,11],[37,9,37,11],[38,9,38,11],[36,4,36,8],[37,4,37,8],[38,4,38,8],[39,1,39,3],[39,12,39,16],[41,1,41,7],[41,10,41,16],[42,1,44,7],[42,9,44,9],[42,10,44,16],[39,9,39,11],[39,4,39,8],[51,1,53,7],[51,9,53,9],[51,10,53,16],[65,3,66,7],[65,8,66,11],[65,12,66,15],[55,2,55,15],[63,2,64,2],[63,3,64,7],[56,2,58,15],[60,2,61,15],[62,3,62,7],[62,8,62,15],[63,8,64,11],[63,12,64,15],[0,0,2,4],[0,5,2,16],[11,9,11,11],[12,9,12,11],[13,9,13,11],[17,9,17,11],[18,9,18,11],[19,9,19,11],[20,9,20,11],[20,12,20,16],[7,13,7,16],[8,1,8,3],[8,4,8,8],[8,9,8,12],[8,13,8,16],[10,1,10,16],[11,1,11,3],[11,4,11,8],[11,12,11,13],[11,14,11,15],[4,9,4,12],[7,9,7,12],[19,12,19,16],[18,1,18,3],[71,2,72,2],[71,3,72,7],[71,8,72,11],[71,12,72,15],[4,13,4,16],[5,9,6,12],[5,13,6,16],[67,2,68,2],[67,3,68,7],[67,8,68,11],[67,12,68,15],[69,2,70,2],[69,3,70,7],[69,8,70,11],[69,12,70,15],[29,9,29,11],[30,9,30,11],[31,9,31,11],[45,1,47,7],[45,9,47,9],[45,10,47,16],[48,1,50,7],[48,9,50,9],[48,10,50,16]]}
[null,null,null,null,null,"HOJA DE CÁLCULO PARA CALIBRACIÓN DE TERMOHIGRÓMETROS-HUMEDAD"]
[]
[]
[]
[null,"Solicitante:",null,null,"Laboratorio de Temperatura y Humedad",null,null,null,null,"Número de certificado:",null,null,null,"LCTH-"]
[null,"Dirección:",null,null,"Avenida carrera 50 #26-50 int 2 del CAN, piso 5",null,null,null,null,"Código interno  LCTD-XX-XXXXX (compuesto por N° Radicado)",null,null,null,"LCTH-"]
[null,"Ciudad:",null,null,"Bogotá D.C."]
[null,"Fecha de recepción:",null,null,null,null,null,null,null,"Unidad de calibración:",null,null,null,"%hr"]
[null,"Fecha de calibración:",null,null,null,null,null,null,null,"Método de calibración:",null,null,null,"Comparación en medio isotérmicos."]
[]
[null,"DATOS DEL INSTRUMENTO BAJO CALIBRACIÓN (IBC)"]
[null,"Instrumento:",null,null,null,null,null,null,null,"Intervalo de medición :",null,null,30,null,80,null,"%hr"]
[null,"Fabricante:",null,null,null,null,null,null,null,"Resolución:",null,null,null,null,{"$f":"+Q12","v":"%hr"}]
[null,"Modelo:",null,null,null,null,null,null,null,"Canal:"]
[null,"Serie:"]
[]
[null,"DATOS DEL INSTRUMENTO UTILIZADO EN LA CALIBRACIÓN"]
[null,"Instrumento:",null,null,"Termohigrómetro data logger",null,null,null,null,"Instrumento:",null,null,"Termohigrómetro digital"]
[null,"Marca:",null,null,"Lufft",null,null,null,null,"Marca:",null,null,"YOWEXA"]
[98,"Serie:",null,null,"022.0714.0802.024 ",null,null,null,null,"Serie:",null,null,"190724GSM0087287"]
[null,"Modelo:",null,null,"Opus 20 8120-10   ",null,null,null,null,"Modelo:",null,null,"No indica"]
[null,"Certificado No:",null,null,"5286 // 5287",null,null,null,null,"Certificado No:",null,null,"5717 // 5720"]
[null,"Proveedor  de trazabilidad:",null,null,"INM",null,null,null,null,"Proveedor  de trazabilidad:",null,null,"INM"]
[null,"Fecha de calibración:",null,null,"2021-06-25 // 2021-06-23",null,null,null,null,"Fecha de calibración:",null,null,"2021-01-27"]
[]
[null,"Instrumento:",null,null,"Cámara climática",null,null,null,null,"Instrumento:"]
[null,"Marca:",null,null,"Memmer",null,null,null,null,"Marca:"]
[null,"Serie:",null,null,"W421.0373",null,null,null,null,"Serie:"]
[null,"Modelo:",null,null,"HPP110ECO",null,null,null,null,"Modelo:"]
[null,"Certificado No:",null,null,"MI-0888",null,null,null,null,"Certificado No:"]
[null,"Proveedor  de trazabilidad:",null,null,"Unión Metrológica",null,null,null,null,"Proveedor  de trazabilidad:"]
[null,"Fecha de calibración:",null,null,"2022-02-10",null,null,null,null,"Fecha de calibración:"]
[]
[null,"Instrumento:",null,null,null,null,null,null,null,"Instrumento:"]
[null,"Marca:",null,null,null,null,null,null,null,"Marca:"]
[null,"Serie:",null,null,null,null,null,null,null,"Serie:"]
[null,"Modelo:",null,null,null,null,null,null,null,"Modelo:"]
[null,"Certificado No:",null,null,null,null,null,null,null,"Certificado No:"]
[null,"Proveedor  de trazabilidad:",null,null,null,null,null,null,null,"Proveedor  de trazabilidad:"]
[null,"Fecha de calibración:",null,null,null,null,null,null,null,"Fecha de calibración:"]
[]
[null,"Verificar que:",null,null,null,null,null,null,"SI","NO","OBSERVACIONES"]
[null,"¿El termohigrómetro está roto?"]
[]
[]
[null,"¿El termohigrómetro está midiendo similar a la temperatura ambiente?"]
[]
[]
[null,"¿El termohigrómetro esta libre de golpes o arañazos?",null,null,null,null,null,null,"X"]
[]
[]
[null,"¿El instrumento de medición presenta todas las partes?",null,null,null,null,null,null,null,null,"Incluye 4 baterias AAA con la mitad de carga"]
[]
[]
[]
[null,null,"OBSERVACIONES"]
[]
[]
[]
[]
[null,null,"Grupo de trabajo del laboratorio"]
[]
[null,null,"No","Nombres",null,null,null,null,"Roles del grupo de trabajo"]
[null,null,"AC","Astrid Camila Riveros Meza",null,null,null,null,"Responsable de la Dirección Técnica del Laboratorio de Temperatura y Humedad",null,null,null,"Metrólogo del Laboratorio Temperatura y Humedad"]
[]
[null,null,"PV","Pedro José Vargas López",null,null,null,null," Sustituto del Responsable de la Dirección Técnica del Laboratorio de Temperatura y Humedad",null,null,null,"Metrólogo del Laboratorio Temperatura y Humedad"]

{"sheet":"RT03-F61","index":1,"n_rows":105,"n_cols":13,"rows_kept":105,"cut":false,"hidden":true,"merged":[[0,0,2,2],[95,6,95,8],[101,5,102,5],[101,6,102,6],[0,3,2,13],[13,8,13,10],[4,5,4,7],[4,3,4,4],[5,5,5,7],[78,6,78,8],[84,5,85,5],[84,6,85,6],[48,6,48,8],[33,6,33,8],[69,5,70,5],[69,6,70,6],[8,0,9,0],[8,1,9,1],[18,6,18,8],[24,5,25,5],[24,6,25,6],[7,3,7,12],[8,3,9,12],[54,5,55,5],[54,6,55,6],[63,6,63,8],[39,5,40,5]]}
[null,null,null,"HOJA DE CÁLCULO PARA CALIBRACIÓN DE TERMOHIGRÓMETROS-HUMEDAD"]
[]
[]
[]
[null,null,null,"Diligenció"]
["Código interno",{"$f":"+'DATOS 0 '!N6","v":"LCTH-"}]
[]
[null,null,null,"OBSERVACIONES"]
[]
[]
[]
[]
[]
[]
[1]
["Humedad Relativa",null,"% hr","Temperatura",null,"°C"]
["n","Patrón %hr","Patrón °C","IBC %hr","IBC °C","Fecha",null,null,null,null,null,"Patrón Corregido % hr","Patrón Corregido °C"]
[1,null,null,null,null,"Hora",null,null,null,null,null,{"$f":"+'RT03-F61'!B18*'interpolación pat'!$B$14+'interpolación pat'!$C$14+B18","v":-8.6687968530171453},"Termohigrómetro digital"]
[2,null,null,null,null,"Patrón",null,null,null,null,null,{"$f":"+'RT03-F61'!B19*'interpolación pat'!$B$14+'interpolación pat'!$C$14+B19","v":-8.6687968530171453},{"$f":"+C19+0.1","v":0.1}]
[3,null,null,null,null,"Medio","Cámara climática",null,null,null,null,{"$f":"+'RT03-F61'!B20*'interpolación pat'!$B$14+'interpolación pat'!$C$14+B20","v":-8.6687968530171453},0.1]
[4,null,null,null,null,"Inmersión",null,"cm","THG:",null,null,{"$f":"+'RT03-F61'!B21*'interpolación pat'!$B$14+'interpolación pat'!$C$14+B21","v":-8.6687968530171453},"No indica"]
[5,null,null,null,null,"ta, °C","ha, % hr","ta, °C","ha, % hr",null,null,{"$f":"+'RT03-F61'!B22*'interpolación pat'!$B$14+'interpolación pat'!$C$14+B22","v":-8.6687968530171453},0.1]
[6,null,null,null,null,null,null,{"$f":"+F23*'Interpol TH'!$B$16+'Interpol TH'!$C$16+F23","v":0.24864429179313646},{"$f":"+G23*'Interpol TH'!$F$16+'Interpol TH'!$G$16+G23","v":-14.526928323457453},null,null,{"$f":"+'RT03-F61'!B23*'interpolación pat'!$B$14+'interpolación pat'!$C$14+B23","v":-8.6687968530171453},0.1]
[7,null,null,null,null,"Estabilidad",{"$f":"+L28","v":1.8841109504205299E-15},{"$f":"+IF(G24<'Interpolación hor '!D7,\"SI\",\"NO\")","v":"SI"},null,null,null,{"$f":"+'RT03-F61'!B24*'interpolación pat'!$B$14+'interpolación pat'!$C$14+B24","v":-8.6687968530171453},"02:24:00"]
[8,null,null,null,null,"¿PASA EL PUNTO DE CALIBRACIÓN?",{"$f":"+IF(H24=\"SI\",\"SI\",\"NO\")","v":"SI"},null,null,null,null,{"$f":"+'RT03-F61'!B25*'interpolación pat'!$B$14+'interpolación pat'!$C$14+B25","v":-8.6687968530171453},0.1]
[9,null,null,null,null,null,null,null,null,null,null,{"$f":"+'RT03-F61'!B26*'interpolación pat'!$B$14+'interpolación pat'!$C$14+B26","v":-8.6687968530171453},0.1]
["PROMEDIO",{"$f":"AVERAGE(B18:B26)","v":{"$error":"#DIV/0!"}},{"$f":"AVERAGE(C18:C26)","v":{"$error":"#DIV/0!"}},{"$f":"AVERAGE(D18:D26)","v":{"$error":"#DIV/0!"}},{"$f":"AVERAGE(E18:E26)","v":{"$error":"#DIV/0!"}},null,null,null,null,null,null,{"$f":"+AVERAGE(L18:L26)","v":-8.6687968530171435},{"$f":"+AVERAGE(M18:M26)","v":9.9999999999999992E-2}]
["DESV EST",{"$f":"STDEV(B18:B26)","v":{"$error":"#DIV/0!"}},{"$f":"STDEV(C18:C26)","v":{"$error":"#DIV/0!"}},{"$f":"STDEV(D18:D26)","v":{"$error":"#DIV/0!"}},{"$f":"STDEV(E18:E26)","v":{"$error":"#DIV/0!"}},null,null,null,null,null,null,{"$f":"STDEV(L18:L26)","v":1.8841109504205299E-15},{"$f":"STDEV(M18:M26)","v":1.4989724041661926E-17}]
[]
[2]
["Humedad Relativa",null,"% hr","Temperatura",null,"°C"]
["n","Patrón %hr","Patrón °C","IBC %hr","IBC °C","Fecha",null,null,null,null,null,"Patrón Corregido % hr","Patrón Corregido °C"]
[1,null,null,null,null,"Hora",null,null,null,null,null,{"$f":"+'RT03-F61'!B33*'interpolación pat'!$B$14+'interpolación pat'!$C$14+B33","v":-8.6687968530171453},{"$f":"+C33+0.1","v":0.1}]
[2,null,null,null,null,"Patrón",null,null,null,null,null,{"$f":"+'RT03-F61'!B34*'interpolación pat'!$B$14+'interpolación pat'!$C$14+B34","v":-8.6687968530171453},{"$f":"+C34+0.1","v":0.1}]
[3,null,null,null,null,"Medio","Cámara climática",null,null,null,null,{"$f":"+'RT03-F61'!B35*'interpolación pat'!$B$14+'interpolación pat'!$C$14+B35","v":-8.6687968530171453},0.1]
[4,null,null,null,null,"Inmersión",null,"cm","THG:",null,null,{"$f":"+'RT03-F61'!B36*'interpolación pat'!$B$14+'interpolación pat'!$C$14+B36","v":-8.6687968530171453},0.1]
[5,null,null,null,null,"ta, °C","ha, % hr","ta, °C","ha, % hr",null,null,{"$f":"+'RT03-F61'!B37*'interpolación pat'!$B$14+'interpolación pat'!$C$14+B37","v":-8.6687968530171453},0.1]
[6,null,null,null,null,null,null,{"$f":"+F38*'Interpol TH'!$B$16+'Interpol TH'!$C$16+F38","v":0.24864429179313646},{"$f":"+G38*'Interpol TH'!$F$16+'Interpol TH'!$G$16+G38","v":-14.526928323457453},null,null,{"$f":"+'RT03-F61'!B38*'interpolación pat'!$B$14+'interpolación pat'!$C$14+B38","v":-8.6687968530171453},0.1]
[7,null,null,null,null,"Estabilidad",{"$f":"L43","v":1.8841109504205299E-15},{"$f":"+IF(G39<'Interpolación hor '!D8,\"SI\",\"NO\")","v":"SI"},null,null,null,{"$f":"+'RT03-F61'!B39*'interpolación pat'!$B$14+'interpolación pat'!$C$14+B39","v":-8.6687968530171453},0.1]
[8,null,null,null,null,"¿PASA EL PUNTO DE CALIBRACIÓN?",{"$f":"+IF(H39=\"SI\",\"SI\",\"NO\")","v":"SI"},null,null,null,null,{"$f":"+'RT03-F61'!B40*'interpolación pat'!$B$14+'interpolación pat'!$C$14+B40","v":-8.6687968530171453},"02:24:00"]
[9,null,null,null,null,null,null,null,null,null,null,{"$f":"+'RT03-F61'!B41*'interpolación pat'!$B$14+'interpolación pat'!$C$14+B41","v":-8.6687968530171453},0.1]
["PROMEDIO",{"$f":"AVERAGE(B33:B41)","v":{"$error":"#DIV/0!"}},{"$f":"AVERAGE(C33:C41)","v":{"$error":"#DIV/0!"}},{"$f":"AVERAGE(D33:D41)","v":{"$error":"#DIV/0!"}},{"$f":"AVERAGE(E33:E41)","v":{"$error":"#DIV/0!"}},null,null,null,null,null,null,{"$f":"+AVERAGE(L33:L41)","v":-8.6687968530171435},{"$f":"+AVERAGE(M33:M41)","v":9.9999999999999992E-2}]
["DESV EST",{"$f":"STDEV(B33:B41)","v":{"$error":"#DIV/0!"}},{"$f":"STDEV(C33:C41)","v":{"$error":"#DIV/0!"}},{"$f":"STDEV(D33:D41)","v":{"$error":"#DIV/0!"}},{"$f":"STDEV(E33:E41)","v":{"$error":"#DIV/0!"}},null,null,null,null,null,null,{"$f":"STDEV(L33:L41)","v":1.8841109504205299E-15},{"$f":"STDEV(M33:M41)","v":1.471961680016039E-17}]
[]
[3]
["t",null,"% hr","Temperatura",null,"°C"]
["n","Patrón %hr","Patrón °C","IBC %hr","IBC °C","Fecha",null,null,null,null,null,"Patrón Corregido % hr","Patrón Corregido °C"]
[1,null,null,null,null,"Hora",null,null,null,null,null,{"$f":"+'RT03-F61'!B48*'interpolación pat'!$B$14+'interpolación pat'!$C$14+B48","v":-8.6687968530171453},{"$f":"+C48+0.1","v":0.1}]
[2,null,null,null,null,"Patrón",null,null,null,null,null,{"$f":"+'RT03-F61'!B49*'interpolación pat'!$B$14+'interpolación pat'!$C$14+B49","v":-8.6687968530171453},{"$f":"+C49+0.1","v":0.1}]
[3,null,null,null,null,"Medio","Cámara climática",null,null,null,null,{"$f":"+'RT03-F61'!B50*'interpolación pat'!$B$14+'interpolación pat'!$C$14+B50","v":-8.6687968530171453},0.1]
[4,null,null,null,null,"Inmersión",null,"cm","THG:",null,null,{"$f":"+'RT03-F61'!B51*'interpolación pat'!$B$14+'interpolación pat'!$C$14+B51","v":-8.6687968530171453},0.1]
[5,null,null,null,null,"ta, °C","ha, % hr","ta, °C",null,null,null,{"$f":"+'RT03-F61'!B52*'interpolación pat'!$B$14+'interpolación pat'!$C$14+B52","v":-8.6687968530171453},0.1]
[6,null,null,null,null,null,null,{"$f":"+F53*'Interpol TH'!$B$16+'Interpol TH'!$C$16+F53","v":0.24864429179313646},null,null,null,{"$f":"+'RT03-F61'!B53*'interpolación pat'!$B$14+'interpolación pat'!$C$14+B53","v":-8.6687968530171453},0.1]
[7,null,null,null,null,"Estabilidad",{"$f":"L58","v":1.8841109504205299E-15},{"$f":"+IF(G54<'Interpolación hor '!D9,\"SI\",\"NO\")","v":"SI"},null,null,null,{"$f":"+'RT03-F61'!B54*'interpolación pat'!$B$14+'interpolación pat'!$C$14+B54","v":-8.6687968530171453},0.1]
[8,null,null,null,null,"¿PASA EL PUNTO DE CALIBRACIÓN?",{"$f":"+IF(H54=\"OK\",\"SI\",\"NO\")","v":"NO"},null,null,null,null,{"$f":"+'RT03-F61'!B55*'interpolación pat'!$B$14+'interpolación pat'!$C$14+B55","v":-8.6687968530171453},0.1]
[9,null,null,null,null,null,null,null,null,null,null,{"$f":"+'RT03-F61'!B56*'interpolación pat'!$B$14+'interpolación pat'!$C$14+B56","v":-8.6687968530171453},0.1]
["PROMEDIO",{"$f":"AVERAGE(B48:B56)","v":{"$error":"#DIV/0!"}},null,{"$f":"AVERAGE(D48:D56)","v":{"$error":"#DIV/0!"}},{"$f":"AVERAGE(E48:E56)","v":{"$error":"#DIV/0!"}},null,null,null,null,null,null,{"$f":"+AVERAGE(L48:L56)","v":-8.6687968530171435},{"$f":"+AVERAGE(M48:M56)","v":9.9999999999999992E-2}]
["DESV EST",{"$f":"STDEV(B48:B56)","v":{"$error":"#DIV/0!"}},{"$f":"STDEV(C48:C56)","v":{"$error":"#DIV/0!"}},{"$f":"STDEV(D48:D56)","v":{"$error":"#DIV/0!"}},{"$f":"STDEV(E48:E56)","v":{"$error":"#DIV/0!"}},null,null,null,null,null,null,{"$f":"STDEV(L48:L56)","v":1.8841109504205299E-15},{"$f":"STDEV(M48:M56)","v":1.471961680016039E-17}]
[]
[4]
["Humedad Relativa",null,"% hr","Temperatura",null,"°C"]
["n","Patrón %hr","Patrón °C","IBC %hr","IBC °C","Fecha",null,null,null,null,null,"Patrón Corregido % hr","Patrón Corregido °C"]
[1,null,null,null,null,"Hora",null,null,null,null,null,{"$f":"+'RT03-F61'!B63*'interpolación pat'!$B$14+'interpolación pat'!$C$14+B63","v":-8.6687968530171453},{"$f":"+C63+0.1","v":0.1}]
[2,null,null,null,null,"Patrón",null,null,null,null,null,{"$f":"+'RT03-F61'!B64*'interpolación pat'!$B$14+'interpolación pat'!$C$14+B64","v":-8.6687968530171453},{"$f":"+C64+0.1","v":0.1}]
[3,null,null,null,null,"Medio","Cámara climática",null,null,null,null,{"$f":"+'RT03-F61'!B65*'interpolación pat'!$B$14+'interpolación pat'!$C$14+B65","v":-8.6687968530171453},0.1]
[4,null,null,null,null,"Inmersión",null,"cm","THG:",null,null,{"$f":"+'RT03-F61'!B66*'interpolación pat'!$B$14+'interpolación pat'!$C$14+B66","v":-8.6687968530171453},0.1]
[5,null,null,null,null,"ta, °C","ha, % hr","ta, °C","ha, % hr",null,null,{"$f":"+'RT03-F61'!B67*'interpolación pat'!$B$14+'interpolación pat'!$C$14+B67","v":-8.6687968530171453},0.1]
[6,null,null,null,null,null,null,{"$f":"+F68*'Interpol TH'!$B$16+'Interpol TH'!$C$16+F68","v":0.24864429179313646},{"$f":"+G68*'Interpol TH'!$F$16+'Interpol TH'!$G$16+G68","v":-14.526928323457453},null,null,{"$f":"+'RT03-F61'!B68*'interpolación pat'!$B$14+'interpolación pat'!$C$14+B68","v":-8.6687968530171453},0.1]
[7,null,null,null,null,"Estabilidad",{"$f":"+L73","v":1.8841109504205299E-15},{"$f":"+IF(G69<'Interpolación hor '!D52,\"SI\",\"NO\")","v":"NO"},null,null,null,{"$f":"+'RT03-F61'!B69*'interpolación pat'!$B$14+'interpolación pat'!$C$14+B69","v":-8.6687968530171453},0.1]
[8,null,null,null,null,"¿PASA EL PUNTO DE CALIBRACIÓN?",{"$f":"+IF(H69=\"SI\",\"SI\",\"NO\")","v":"NO"},null,null,null,null,{"$f":"+'RT03-F61'!B70*'interpolación pat'!$B$14+'interpolación pat'!$C$14+B70","v":-8.6687968530171453},0.1]
[9,null,null,null,null,null,null,null,null,null,null,{"$f":"+'RT03-F61'!B71*'interpolación pat'!$B$14+'interpolación pat'!$C$14+B71","v":-8.6687968530171453},0.1]
["PROMEDIO",{"$f":"AVERAGE(B63:B71)","v":{"$error":"#DIV/0!"}},{"$f":"AVERAGE(C63:C71)","v":{"$error":"#DIV/0!"}},{"$f":"AVERAGE(D63:D71)","v":{"$error":"#DIV/0!"}},{"$f":"AVERAGE(E63:E71)","v":{"$error":"#DIV/0!"}},null,null,null,null,null,null,{"$f":"+AVERAGE(L63:L71)","v":-8.6687968530171435},{"$f":"+AVERAGE(M63:M71)","v":9.9999999999999992E-2}]
["DESV EST",{"$f":"STDEV(B63:B71)","v":{"$error":"#DIV/0!"}},{"$f":"STDEV(C63:C71)","v":{"$error":"#DIV/0!"}},{"$f":"STDEV(D63:D71)","v":{"$error":"#DIV/0!"}},{"$f":"STDEV(E63:E71)","v":{"$error":"#DIV/0!"}},null,null,null,null,null,null,{"$f":"STDEV(L63:L71)","v":1.8841109504205299E-15},{"$f":"STDEV(M63:M71)","v":1.471961680016039E-17}]
[]
["Punto de histéresis"]
["t",null,"% hr","Temperatura",null,"°C"]
["n","Patrón %hr","Patrón °C","IBC %hr","IBC °C","Fecha",null,null,null,null,null,"Patrón Corregido %hr","Patrón Corregido °C"]
[1,null,null,null,null,"Hora",null,null,null,null,null,{"$f":"+'RT03-F61'!B78*'interpolación pat'!$B$14+'interpolación pat'!$C$14+B78","v":-8.6687968530171453},{"$f":"+C78+0.1","v":0.1}]
[2,null,null,null,null,"Patrón",null,null,null,null,null,{"$f":"+'RT03-F61'!B79*'interpolación pat'!$B$14+'interpolación pat'!$C$14+B79","v":-8.6687968530171453},{"$f":"+C79+0.1","v":0.1}]
[3,null,null,null,null,"Medio","Cámara climática",null,null,null,null,{"$f":"+'RT03-F61'!B80*'interpolación pat'!$B$14+'interpolación pat'!$C$14+B80","v":-8.6687968530171453},0.1]
[4,null,null,null,null,"Inmersión",null,"cm","THG:",null,null,{"$f":"+'RT03-F61'!B81*'interpolación pat'!$B$14+'interpolación pat'!$C$14+B81","v":-8.6687968530171453},0.1]
[5,null,null,null,null,"ta, °C","ha, % hr","ta, °C","ha, % hr",null,null,{"$f":"+'RT03-F61'!B82*'interpolación pat'!$B$14+'interpolación pat'!$C$14+B82","v":-8.6687968530171453},0.1]
[6,null,null,null,null,null,null,{"$f":"+F83*'Interpol TH'!$B$16+'Interpol TH'!$C$16+F83","v":0.24864429179313646},{"$f":"+G83*'Interpol TH'!$F$16+'Interpol TH'!$G$16+G83","v":-14.526928323457453},null,null,{"$f":"+'RT03-F61'!B83*'interpolación pat'!$B$14+'interpolación pat'!$C$14+B83","v":-8.6687968530171453},0.1]
[7,null,null,null,null,"Estabilidad",{"$f":"L88","v":1.8841109504205299E-15},{"$f":"+IF(G84<'Interpolación hor '!D7,\"SI\",\"NO\")","v":"SI"},null,null,null,{"$f":"+'RT03-F61'!B84*'interpolación pat'!$B$14+'interpolación pat'!$C$14+B84","v":-8.6687968530171453},0.1]
[8,null,null,null,null,"¿PASA EL PUNTO DE CALIBRACIÓN?",{"$f":"+IF(H84=\"SI\",\"SI\",\"NO\")","v":"SI"},null,null,null,null,{"$f":"+'RT03-F61'!B85*'interpolación pat'!$B$14+'interpolación pat'!$C$14+B85","v":-8.6687968530171453},0.1]
[9,null,null,null,null,null,null,null,null,null,null,{"$f":"+'RT03-F61'!B86*'interpolación pat'!$B$14+'interpolación pat'!$C$14+B86","v":-8.6687968530171453},0.1]
["PROMEDIO",{"$f":"AVERAGE(B78:B86)","v":{"$error":"#DIV/0!"}},{"$f":"AVERAGE(C78:C86)","v":{"$error":"#DIV/0!"}},{"$f":"AVERAGE(D78:D86)","v":{"$error":"#DIV/0!"}},{"$f":"AVERAGE(E78:E86)","v":{"$error":"#DIV/0!"}},null,null,null,null,null,null,{"$f":"+AVERAGE(L78:L86)","v":-8.6687968530171435},{"$f":"+AVERAGE(M78:M86)","v":9.9999999999999992E-2}]
["DESV EST",{"$f":"STDEV(B78:B86)","v":{"$error":"#DIV/0!"}},{"$f":"STDEV(C78:C86)","v":{"$error":"#DIV/0!"}},{"$f":"STDEV(D78:D86)","v":{"$error":"#DIV/0!"}},{"$f":"STDEV(E78:E86)","v":{"$error":"#DIV/0!"}},null,null,null,null,null,null,{"$f":"STDEV(L78:L86)","v":1.8841109504205299E-15},{"$f":"STDEV(M78:M86)","v":1.471961680016039E-17}]
[]
[]
["Efecto de la temperatura"]
["t",null,"% hr",null,"°C"]
["n","Patrón %hr","Patrón °C","IBC %hr","IBC °C"]
[1,null,null,null,null,"Fecha",null,null,null,null,null,"Patrón corregido %hr","Patrón corregido °C"]
[2,null,null,null,null,"Hora",null,null,null,null,null,{"$f":"+'RT03-F61'!B94*'interpolación pat'!$B$14+'interpolación pat'!$C$14+B94","v":-8.6687968530171453},{"$f":"+C95+0.1","v":0.1}]
[3,null,null,null,null,"Patrón",null,null,null,null,null,{"$f":"+'RT03-F61'!B95*'interpolación pat'!$B$14+'interpolación pat'!$C$14+B95","v":-8.6687968530171453},{"$f":"+C96+0.1","v":0.1}]
[4,null,null,null,null,"Medio","Cámara climática",null,null,null,null,{"$f":"+'RT03-F61'!B96*'interpolación pat'!$B$14+'interpolación pat'!$C$14+B96","v":-8.6687968530171453},0.1]
[5,null,null,null,null,"Inmersión",null,"cm","THG:",null,null,{"$f":"+'RT03-F61'!B97*'interpolación pat'!$B$14+'interpolación pat'!$C$14+B97","v":-8.6687968530171453},0.1]
[6,null,null,null,null,"ta, °C","ha, % hr","ta, °C","ha, % hr",null,null,{"$f":"+'RT03-F61'!B98*'interpolación pat'!$B$14+'interpolación pat'!$C$14+B98","v":-8.6687968530171453},0.1]
[7,null,null,null,null,null,null,{"$f":"+F100*'Interpol TH'!$B$16+'Interpol TH'!$C$16+F100","v":0.24864429179313646},{"$f":"+G100*'Interpol TH'!$F$16+'Interpol TH'!$G$16+G100","v":-14.526928323457453},null,null,{"$f":"+'RT03-F61'!B99*'interpolación pat'!$B$14+'interpolación pat'!$C$14+B99","v":-8.6687968530171453},0.1]
[8,null,null,null,null,"Estabilidad",{"$f":"L105","v":1.8841109504205299E-15},{"$f":"+IF(G101<'Interpolación hor '!D8,\"SI\",\"NO\")","v":"SI"},null,null,null,{"$f":"+'RT03-F61'!B100*'interpolación pat'!$B$14+'interpolación pat'!$C$14+B100","v":-8.6687968530171453},0.1]
[9,null,null,null,null,"¿PASA EL PUNTO DE CALIBRACIÓN?",{"$f":"+IF(H101=\"SI\",\"SI\",\"NO\")","v":"SI"},null,null,null,null,{"$f":"+'RT03-F61'!B101*'interpolación pat'!$B$14+'interpolación pat'!$C$14+B101","v":-8.6687968530171453},0.1]
["PROMEDIO",{"$f":"AVERAGE(B94:B102)","v":{"$error":"#DIV/0!"}},{"$f":"AVERAGE(C94:C102)","v":{"$error":"#DIV/0!"}},{"$error":"#DIV/0!"},{"$error":"#DIV/0!"},null,null,null,null,null,null,{"$f":"+'RT03-F61'!B102*'interpolación pat'!$B$14+'interpolación pat'!$C$14+B102","v":-8.6687968530171453},{"$error":"#DIV/0!"}]
["DESV EST",{"$f":"STDEV(C94:C102)","v":{"$error":"#DIV/0!"}},{"$f":"STDEV(B94:B102)","v":{"$error":"#DIV/0!"}},{"$f":"STDEV(E94:E102)","v":{"$error":"#DIV/0!"}},{"$f":"STDEV(D94:D102)","v":{"$error":"#DIV/0!"}},null,null,null,null,null,null,{"$f":"+AVERAGE(L95:L103)","v":-8.6687968530171435},{"$f":"+AVERAGE(M95:M103)","v":{"$error":"#DIV/0!"}}]
[null,null,null,null,null,null,null,null,null,null,null,{"$f":"STDEV(L95:L103)","v":1.8841109504205299E-15},{"$f":"STDEV(M95:M103)","v":{"$error":"#DIV/0!"}}]

{"sheet":"Interpol TH","index":2,"n_rows":21,"n_cols":13,"rows_kept":21,"cut":false,"hidden":true,"merged":[[13,1,13,3],[13,5,13,7],[0,0,2,2],[0,3,2,7],[5,1,5,3],[5,5,5,7],[6,1,6,3],[6,5,6,7]]}
[null,null,null,"HOJA DE CÁLCULO PARA CALIBRACIÓN DE TERMOHIGRÓMETROS-HUMEDAD"]
[]
[]
[]
[]
[null,"Número de certificado y fecha de calibración\n5720, 2021-01-27",null,null,null,"Número de certificado y fecha de calibración\n 5717, 2021-01-27"]
[null,"Temperatura  °C",null,null,null,"Humedad %hr"]
[null,"V medido","Corrección","U",null,"V medido","Corrección","U"]
[null,9.6999999999999993,0.2,0.2,null,37.1,-7.1,1.7]
[null,24.9,0.2,0.2,null,54.2,-4.2,1.7]
[null,40,0.1,0.2,null,79.8,1.2,1.7]
[]
[]
[null,"Interpolación",null,null,null,"Interpolación"]
[null,"m","b",null,null,"m","b"]
[null,{"$f":"+LINEST(C9:C11,B9:B11,TRUE,TRUE)","v":-3.296687337525596E-3},0.24864429179313646,{"$error":"#N/A"},null,{"$f":"+LINEST(G9:G11,F9:F11,TRUE,TRUE)","v":0.19567963162111254},-14.526928323457453,{"$error":"#N/A"}]
[null,1.9117280940969645E-3,5.3095358346903605E-2,{"$error":"#N/A"},null,1.1313403396893866E-2,0.67508858069298194,{"$error":"#N/A"}]
[null,0.74834802561831038,4.0959490099502754E-2,{"$error":"#N/A"},null,0.99666845247259106,0.34383937614723514,{"$error":"#N/A"},null,null,null,null,"Termohigrómetro digital"]
[null,2.973741920590951,1,{"$error":"#N/A"},null,299.1608086851229,1,{"$error":"#N/A"}]
[null,4.9889868374554036E-3,1.6776798292112642E-3,{"$error":"#N/A"},null,35.368441150077345,0.11822551658931986,{"$error":"#N/A"}]
[null,null,null,null,null,null,null,null,null,null,null,null,"No indica"]

{"sheet":"Incertidumbre","index":3,"n_rows":105,"n_cols":25,"rows_kept":105,"cut":false,"hidden":true,"merged":[[67,17,68,17],[80,1,80,3],[67,9,68,9],[67,10,68,10],[67,11,67,12],[67,14,67,15],[67,16,68,16],[67,4,68,4],[67,5,68,5],[67,6,68,6],[67,7,68,7],[67,8,68,8],[71,1,71,3],[73,1,73,3],[46,17,47,17],[46,14,46,15],[59,1,59,3],[0,4,2,19],[0,0,2,3],[46,9,47,9],[46,10,47,10],[46,11,46,12],[46,16,47,16],[46,4,47,4],[46,5,47,5],[46,6,47,6],[46,7,47,7],[46,8,47,8],[25,8,26,8],[25,14,25,15],[25,16,26,16],[25,17,26,17],[25,11,25,12],[25,10,26,10],[25,9,26,9],[25,4,26,4],[25,5,26,5],[25,6,26,6],[25,7,26,7],[57,1,57,3],[49,1,49,3],[68,1,68,3],[69,1,69,3],[70,1,70,3],[52,1,52,3],[53,1,53,3],[54,1,54,3],[56,1,56,3],[55,1,55,3],[58,1,58,3],[60,1,60,3],[50,1,50,3],[51,1,51,3],[81,1,81,3],[74,1,74,3],[76,1,76,3],[77,1,77,3],[78,1,78,3],[79,1,79,3],[75,1,75,3],[72,1,72,3],[27,1,27,3],[7,1,7,3],[8,1,8,3],[11,1,11,3],[12,1,12,3],[9,1,9,3],[10,1,10,3],[13,1,13,3],[14,1,14,3],[15,1,15,3],[16,1,16,3],[17,1,17,3],[18,1,18,3],[19,1,19,3],[26,1,26,3],[48,1,48,3],[33,1,33,3],[34,1,34,3],[39,1,39,3],[28,1,28,3],[32,1,32,3],[31,1,31,3],[36,1,36,3],[37,1,37,3],[47,1,47,3],[35,1,35,3],[41,0,44,3],[29,1,29,3],[30,1,30,3],[38,1,38,3],[89,1,89,3],[90,1,90,3],[91,1,91,3],[92,1,92,3],[98,1,98,3],[99,1,99,3],[100,1,100,3],[101,1,101,3],[93,1,93,3],[94,1,94,3],[95,1,95,3],[96,1,96,3],[97,1,97,3]]}
[null,null,null,null,"HOJA DE CÁLCULO PARA CALIBRACIÓN DE TERMOHIGRÓMETROS-HUMEDAD"]
[]
[]
[]
[]
[]
["SP °C",{"$f":"+[4]DATOS!B76","v":30},null,null,"Bogotá D.C.",null,null,null,null,null,null,"Incertidumbre Standard",null,"Grados de Libertad","Coeficiente de Sensibilidad",null,null,null,"Porcentaje"]
[null,"Fuente de Incertidumbre",null,null,"Valor Estimado","Unidad","Tipo","Distribución","u","Unidad","Factor","u típica","Unidad","G.L.","Ci","Unidad","Contribución a u","Unidad","%"]
[null,"Repetibilidad del Patrón 1",null,null,{"$f":"+[4]DATOS!B87","v":32.699999999999996},"°C","A","N",{"$f":"+[4]DATOS!B88","v":7.5364438016821196E-15},"°C",3,{"$f":"I9/K9","v":2.5121479338940399E-15},{"$f":"+J9","v":"°C"},8,1,"--",{"$f":"ABS(L9*O9)","v":2.5121479338940399E-15},"°C",{"$f":"(Q9*100%)^2/$L$20^2","v":{"$error":"#REF!"}},null,null,"Uniformidad °C","Estabilidad °C"]
[null,"Incertidumbre del Termómetro Patrón 1",null,null,0,"-","B","N",{"$f":"+IF(E9<200,V17,V16)","v":4720.3807049999978},"°C",2,{"$f":"I10/K10","v":2360.1903524999989},{"$f":"+J10","v":"°C"},199.99999999999966,1,"--",2360.1903524999989,"°C",{"$error":"#REF!"},null,9150,{"$f":"+[4]Incertidumbre!E9^2*'[4]Interpolación hor '!#REF!++[4]Incertidumbre!E9*'[4]Interpolación hor '!#REF!+'[4]Interpolación hor '!#REF!","v":{"$error":"#REF!"}},{"$f":"+E9^2*'[4]Interpolación hor '!#REF!+E9*'[4]Interpolación hor '!#REF!+'[4]Interpolación hor '!#REF!","v":{"$error":"#REF!"}}]
[null,"Resolución Indicador patrón",null,null,0,"-","B","R",1E-3,"Ohm",1.7320508075688772,5.773502691896258E-4,"Ohm",1000000,3.9249999999999997E-3,"°C/Ohm",2.2660998065692812E-6,"°C",{"$error":"#REF!"},null,7103,{"$f":"+E9*'[4]Interpolación hor '!$B$19+'[4]Interpolación hor '!$C$19","v":-1.0910333333333294E-2},{"$f":"+E9*'[4]Interpolación hor '!$B$26+'[4]Interpolación hor '!$C$26","v":-2.2549499999999965E-2}]
[null,"Deriva del Termómetro Patrón 1",null,null,0,"-","B","R",{"$f":"+IF($E9<200,[4]Incertidumbre!W17,[4]Incertidumbre!W16)","v":0.01},"Ohm",1.7320508075688772,5.773502691896258E-3,"Ohm",1000000,3.9249999999999997E-3,"°C/Ohm",2.2660998065692809E-5,"°C",{"$error":"#REF!"},null,6330,{"$f":"+E9*'[4]Interpolación hor '!#REF!+'[4]Interpolación hor '!#REF!","v":{"$error":"#REF!"}},{"$f":"+E9*'[4]Interpolación hor '!#REF!+'[4]Interpolación hor '!#REF!","v":{"$error":"#REF!"}}]
[null,"Incertidumbre del indicador",null,null,0,"-","B","N",{"$f":"+IF(E9<200,[4]Incertidumbre!X17,[4]Incertidumbre!X16)","v":{"$error":"#REF!"}},{"$f":"+IF([4]DATOS!#REF!<200, \"Ohm\", \"mV\")","v":{"$error":"#REF!"}},2,{"$error":"#REF!"},{"$error":"#REF!"},200,3.9249999999999997E-3,"°C/Ohm",{"$error":"#REF!"},"°C",{"$error":"#REF!"}]
[null,"Deriva del indicador",null,null,0,"-","B","R",{"$f":"+IF(E9<200,[4]Incertidumbre!X17/2,X16/2)","v":{"$error":"#REF!"}},{"$f":"+IF([4]DATOS!#REF!<200, \"Ohm\", \"mV\")","v":{"$error":"#REF!"}},1.7320508075688772,{"$error":"#REF!"},{"$error":"#REF!"},1000000,3.9250999999999999E-3,"°C/Ohm",{"$error":"#REF!"},"°C",{"$error":"#REF!"}]
[null,"Uniformidad del medio",null,null,0,"-","B","R",{"$f":"+IF(+[4]DATOS!D82=7103,V11,IF([4]DATOS!D82=6330,V12,IF([4]DATOS!D82=9150,V10,\"REVISAR\")))","v":"REVISAR"},"°C",1.7320508075688772,{"$error":"#VALUE!"},"°C",1000000,1,"--",{"$error":"#VALUE!"},"°C",{"$error":"#VALUE!"},null,null,"U sensor °C","deriva °C","U indicador ohm","Resolución"]
[null,"Estabilidad",null,null,0,"-","B","R",{"$f":"+IF([4]DATOS!D82=7103,$W$11,IF([4]DATOS!D82=6330,$W$12,IF([4]DATOS!D82=9150,$W$10,\"REVISAR\")))","v":"REVISAR"},"°C",1.7320508075688772,{"$error":"#VALUE!"},"°C",1000000,1,"--",{"$error":"#VALUE!"},"°C",{"$error":"#VALUE!"},null,"Ter Tipo R",{"$f":"+E9^3*'[4]interpolación pat'!$B$24+E9^2*'[4]interpolación pat'!$C$11+E9*'[4]interpolación pat'!$D$21+'[4]interpolación pat'!$E$21","v":0},0.5,{"$f":"+[4]DATOS!B87^4*#REF!+[4]DATOS!B87^3*#REF!+[4]DATOS!B87^2*#REF!+[4]DATOS!B87*#REF!+#REF!","v":{"$error":"#REF!"}},1.0000000000000001E-5]
[null,"Repetibilidad del Termómetro IBC",null,null,{"$f":"+[4]DATOS!J88","v":0},"°C","A","N",{"$f":"+[4]DATOS!T89","v":0},"°C",3,0,"°C",8,1,"--",0,"°C",{"$error":"#REF!"},null,"PRT pt 100",{"$f":"+E9^4*'[4]interpolación pat'!$I$14+E9^3*'[4]interpolación pat'!$J$14+E9^2*'[4]interpolación pat'!$K$14+E9*'[4]interpolación pat'!$L$14+'[4]interpolación pat'!$M$14","v":4720.3807049999978},0.01,{"$f":"+[4]DATOS!B87^4*#REF!+[4]DATOS!B87^3*#REF!+[4]DATOS!B87^2*#REF!+[4]DATOS!B87*#REF!+#REF!","v":{"$error":"#REF!"}},1E-4]
[null,"Resolución Indicador ",null,null,0,"-","B","R",{"$f":"+'[4]DATOS 0 RT03-F61'!K13","v":0.1},"°C",1.7320508075688772,5.7735026918962581E-2,"Termohigrómetro digital",1000000,1,"--",5.7735026918962581E-2,"°C",{"$error":"#REF!"}]
[null,"Variación en cero",null,null,{"$f":"+ABS([4]DATOS!#REF!-[4]DATOS!$J$88)","v":{"$error":"#REF!"}},"°C","A","R",{"$f":"+E19/2","v":{"$error":"#REF!"}},"°C",1.7320508075688772,{"$error":"#REF!"},"°C",1000000,1,"--",{"$error":"#REF!"},"°C",{"$error":"#REF!"}]
[null,"Corrección",null,null,{"$f":"+E9-E17","v":32.699999999999996},"-","A","N",{"$f":"L20*K20","v":{"$error":"#REF!"}},"°C",{"$f":"TINV(0.05,N20)","v":{"$error":"#REF!"}},{"$f":"(SUMSQ(Q9:Q19)^0.5)","v":{"$error":"#REF!"}},"°C",{"$f":"L20^4/(Q9^4/N9+Q10^4/N10+Q11^4/N11+Q12^4/N12+Q13^4/N13+Q14^4/N14+Q15^4/N15+Q16^4/N16+Q17^4/N17+Q18^4/N18+Q19^4/N19)","v":{"$error":"#REF!"}},null,null,null,null,{"$f":"SUM(S9:S19)","v":{"$error":"#REF!"}}]
[null,null,null,null,null,null,null,null,null,null,null,null,"No indica"]
[null,null,null,null,"Corrección   C (°C)","K",null,"°C"]
[null,null,null,null,{"$f":"+E20","v":32.699999999999996},{"$f":"K20","v":{"$error":"#REF!"}},"±",{"$f":"I20","v":{"$error":"#REF!"}}]
[null,null,null,null,null,null,null,null,"SE HACE REDONDEO DE DECIMALES TAL COMO LO RECOMIENDA LA GUM"]
[]
["SP %hr",{"$f":"+[4]DATOS!B16","v":30},null,null,"Valor Estimado","Unidad","Tipo","Distribución","u","Unidad","Factor","Incertidumbre Standard",null,"Grados de Libertad","Coeficiente de Sensibilidad",null,"Contribución a u","Unidad","Porcentaje"]
[null,"Fuente de Incertidumbre",null,null,null,null,null,null,null,null,null,"u típica","Unidad","G.L.","Ci","Unidad",null,null,"%"]
[1,"Repetibilidad del patrón ",null,null,{"$f":"+[4]DATOS!L27","v":28.78361615270768},"%hr","A","N",{"$f":"+[4]DATOS!L28","v":5.0850036338914058E-2},"%hr",3,{"$f":"I28/K28","v":1.6950012112971351E-2},{"$f":"+J28","v":"%hr"},8,1,"--",{"$f":"ABS(L28*O28)","v":1.6950012112971351E-2},"%hr",{"$f":"(Q28*100%)^2/$L$40^2","v":2.0063679251365325E-4}]
[2,"Incertidumbre del patrón ",null,null,0,"-","B","N",1.7,"%hr",2,{"$f":"I29/K29","v":0.85},{"$f":"+J29","v":"%hr"},199.99999999999966,1,"--",0.85,"%hr",{"$f":"(Q29*100%)^2/$L$40^2","v":0.50455486953928752}]
[3,"Interpolación corrección patrón",null,null,0,"-","B","N",{"$f":"+SQRT('[4]interpolación pat'!$C$18/(3-2))","v":0.3180299060332894},"%hr",{"$f":"+SQRT(3)","v":1.7320508075688772},0.18361465185867104,"%hr",199.99999999999966,1,"--",0.18361465185867104,"%hr",2.3544269357247998E-2]
[4,"Efecto de la temperatura del patrón",null,null,0,"%hr","B","R",{"$f":"+MAX('[4]interpolación pat'!$D$7,'[4]Interpolación hor '!$F$7)","v":1.7},"°C",1.7320508075688772,0.98149545762236379,"°C",1000000,{"$f":"+ABS([4]DATOS!$B$42-[4]DATOS!$B$103)/ABS([4]DATOS!$C$42-[4]DATOS!$C$103)","v":7.258514796203301E-3},"%hr/°C",7.1241993015582579E-3,"%hr",3.5443995398187899E-5]
[5,"Resolución  patrón",null,null,"00:00:00","-","B","R","02:24:00","%hr",1.7320508075688772,5.7735026918962581E-2,"%hr","4637-11-26","1900-01-01","--","01:23:08.306","%hr",2.3278194673092855E-3]
[6,"Deriva del termómetro patrón 1",null,null,0,"-","B","R",0.7,"%hr",1.7320508075688772,0.40414518843273806,"%hr",1000000,1,"--",0.40414518843273806,"%hr",0.114063153898155]
[7,"Uniformidad del medio",null,null,null,"-","B","R",{"$f":"+'[4]Interpolación hor '!C7","v":1.19},"%hr",1.7320508075688772,0.68704682033565467,"%hr",1000000,1,"--",0.68704682033565467,"%hr",0.32964251476566792]
[8,"Estabilidad",null,null,0,"-","B","R",{"$f":"+'[4]Interpolación hor '!D7","v":0.26},"%hr",1.7320508075688772,0.15011106998930271,"%hr",1000000,1,"--",0.15011106998930271,"%hr",1.5736059599010768E-2]
[9,"Repetibilidad del termómetro IBC",null,null,{"$f":"+[4]DATOS!D27","v":31.722222222222214},"°C","A","N",{"$f":"+[4]DATOS!D28","v":4.4095855184410469E-2},"%hr",3,1.469861839480349E-2,"%hr",8,1,"--",1.469861839480349E-2,"%hr",1.5087718769597649E-4]
[10,"Resolución indicador IBC",null,null,0,"-","B","R",{"$f":"+'[4]DATOS 0 RT03-F61'!K13","v":0.1},"%hr",1.7320508075688772,5.7735026918962581E-2,"%hr",1000000,1,"--",5.7735026918962581E-2,"%hr",2.3278194673092855E-3]
[11,"Histéresis",null,null,0,"-","A","R",{"$f":"+ABS([4]DATOS!$D$27-[4]DATOS!$D$87)","v":0.1777777777777878},"%hr",1.7320508075688772,0.10264004785593926,"%hr",1000000,1,"--",0.10264004785593926,"%hr",7.3570590571758552E-3]
[12,"Efecto de la temperatura del patrón",null,null,0,"°C","B","R",{"$f":"+MAX('[4]interpolación pat'!$D$7,'[4]Interpolación hor '!$F$7)","v":1.7},"°C",1.7320508075688772,0.98149545762236379,"°C",1000000,{"$f":"+ABS([4]DATOS!$D$42-[4]DATOS!$B$103)/ABS([4]DATOS!$E$42-[4]DATOS!$E$103)","v":9.4026548672563395E-3},"%hr/°C",9.2286630418029064E-3,"%hr",5.9476873228475238E-5]
[null,"Corrección",null,null,{"$f":"+E28-E36","v":-2.9386060695145346},"%hr","A","N",{"$f":"L40*K40","v":"1900-01-02T08:22:34.364"},"%hr",{"$f":"TINV(0.05,N40)","v":1.9629983142029626},{"$f":"(SUMSQ(Q28:Q39)^0.5)","v":1.1966433308209639},"%hr",{"$f":"L40^4/(Q28^4/N28+Q29^4/N29+Q30^4/N30++Q31^4/N31+Q32^4/N32+Q33^4/N33+Q34^4/N34+Q35^4/N35+Q36^4/N36+Q37^4/N37+Q38^4/N38+Q39^4/N39)","v":"1902-02-21T20:01:35.900"},null,null,null,null,{"$f":"SUM(S28:S38)","v":0.99994052312677162}]
[]
[null,null,null,null,"Corrección    (%hr)","K",null,"U %hr"]
[null,null,null,null,{"$f":"+E40","v":-2.9386060695145346},{"$f":"K40","v":1.9629983142029626},"±",{"$f":"I40","v":2.3490088411037702}]
[null,null,null,null,null,null,null,null,"SE HACE REDONDEO DE DECIMALES TAL COMO LO RECOMIENDA LA GUM"]
[]
[]
["SP %hr",50,null,null,"Valor Estimado","Unidad","Tipo","Distribución",null,"Unidad","Factor","Incertidumbre Standard",null,"Grados de Libertad","Coeficiente de Sensibilidad",null,"Contribución a u","Unidad","Porcentaje"]
[null,"Fuente de Incertidumbre",null,null,null,null,null,null,null,null,null,"u típica","Unidad","G.L.","Ci","Unidad",null,null,"%"]
[1,"Repetibilidad del patrón ",null,null,{"$f":"+[4]DATOS!L42","v":49.425366871908054},"°C","A","N",{"$f":"+[4]DATOS!L43","v":5.0850036338915626E-2},"%hr",3,{"$f":"I49/K49","v":1.6950012112971875E-2},{"$f":"+J49","v":"%hr"},8,1,"--",{"$f":"ABS(L49*O49)","v":1.6950012112971875E-2},"%hr",{"$f":"(Q49*100%)^2/$L$61^2","v":2.4090519609717436E-4}]
[2,"Incertidumbre del termómetro patrón ",null,null,0,"-","B","N",1.7,"%hr",2,{"$f":"I50/K50","v":0.85},{"$f":"+J50","v":"%hr"},199.99999999999966,1,"--",{"$f":"ABS(L50*O50)","v":0.85},"%hr",{"$f":"(Q50*100%)^2/$L$61^2","v":0.60582053902136301}]
[3,"Interpolación corrección patrón",null,null,0,"-","B","N",{"$f":"+SQRT('[4]interpolación pat'!$C$18/(3-2))","v":0.3180299060332894},"%hr",{"$f":"+K30","v":1.7320508075688772},0.18361465185867104,"%hr",199.99999999999966,1,"--",0.18361465185867104,"%hr",2.8269674546786826E-2]
[4,"Efecto de la temperatura del patrón",null,null,0,"%hr","B","R",null,"°C",1.7320508075688772,0,"°C",1000000,{"$f":"+ABS([4]DATOS!$B$42-[4]DATOS!$B$103)/ABS([4]DATOS!$C$42-[4]DATOS!$C$103)","v":7.258514796203301E-3},"%hr/°C",0,"%hr",{"$f":"(Q52*100%)^2/$L$40^2","v":0}]
[5,"Resolución indicador patrón",null,null,0,"-","B","R",null,"%hr",1.7320508075688772,0,"%hr",1000000,1,"--",0,"%hr",0]
[6,"Deriva del termómetro patrón 1",null,null,0,"-","B","R",null,"%hr",1.7320508075688772,0,"%hr",1000000,1,"--",0,"%hr",0]
[7,"Uniformidad del medio",null,null,0,"-","B","R",{"$f":"+'[4]Interpolación hor '!C8","v":1.1200000000000001},"%hr",1.7320508075688772,0.64663230149238093,"%hr",1000000,1,"--",0.64663230149238093,"%hr",0.35060728219072573]
[8,"Estabilidad",null,null,0,"-","B","R",{"$f":"+'[4]Interpolación hor '!D8","v":0.107},"%hr",1.7320508075688772,6.1776478803289958E-2,"%hr",1000000,1,"--",6.1776478803289958E-2,"%hr",3.2000181551352187E-3]
[9,"Repetibilidad del termómetro IBC",null,null,{"$f":"+[4]DATOS!D42","v":50.333333333333336},"°C","A","N",{"$f":"+[4]DATOS!D43","v":5.0000000000000711E-2},"%hr",3,1.6666666666666902E-2,"%hr",8,1,"--",1.6666666666666902E-2,"%hr",2.3291831565604778E-4]
[10,"Resolución indicador IBC",null,null,0,"-","B","R",{"$f":"+I37","v":0.1},"%hr",1.7320508075688772,5.7735026918962581E-2,"%hr",1000000,1,"--",5.7735026918962581E-2,"%hr",2.7950197878724948E-3]
[11,"Histéresis",null,null,1,"-","A","R",{"$f":"+I38","v":0.1777777777777878},"%hr",1.7320508075688772,0.10264004785593926,"%hr",1000000,1,"--",0.10264004785593926,"%hr",8.8336427863634475E-3]
[12,"Efecto de la temperatura del patrón",null,null,0,"°C","B","R",{"$f":"+MAX('[4]interpolación pat'!$D$7,'[4]Interpolación hor '!$F$7)","v":1.7},"°C",1.7320508075688772,0.98149545762236379,"°C",1000000,{"$f":"+ABS([4]DATOS!$D$42-[4]DATOS!$B$103)/ABS([4]DATOS!$E$42-[4]DATOS!$E$103)","v":9.4026548672563395E-3},"%hr/°C",9.2286630418029064E-3,"%hr",{"$f":"(Q60*100%)^2/$L$40^2","v":5.9476873228475238E-5}]
[null,"Corrección",null,null,{"$f":"+E49-E57","v":-0.90796646142528203},"%hr","A","N",{"$f":"L61*K61","v":2.1451818776216927},"%hr",{"$f":"TINV(0.05,N61)","v":1.96434239684253},{"$f":"(SUMSQ(Q49:Q59)^0.5)","v":1.0920610791020153},"°C",{"$f":"L61^4/(Q49^4/N49+Q50^4/N50+Q51^4/N51+Q53^4/N53+Q54^4/N54+Q55^4/N55+Q56^4/N56+Q57^4/N57+Q58^4/N58+Q59^4/N59)","v":543.7071032506044},null,null,null,null,{"$f":"SUM(S49:S59)","v":1}]
[]
[null,null,null,null,"Corrección   C (°C)","K",null,"°C"]
[null,null,null,null,{"$f":"+E61","v":-0.90796646142528203},{"$f":"K61","v":1.96434239684253},"±",{"$f":"I61","v":2.1451818776216927}]
[null,null,null,null,null,null,null,null,"SE HACE REDONDEO DE DECIMALES TAL COMO LO RECOMIENDA LA GUM"]
[]
[]
["SP °C",{"$f":"+[4]DATOS!B46","v":80},null,null,"Valor Estimado","Unidad","Tipo","Distribución","u","Unidad","Factor","Incertidumbre Standard",null,"Grados de Libertad","Coeficiente de Sensibilidad",null,"Contribución a u","Unidad","Porcentaje"]
[null,"Fuente de Incertidumbre",null,null,null,null,null,null,null,null,null,"u típica","Unidad","G.L.","Ci","Unidad",null,null,"%"]
[1,"Repetibilidad del patrón 1",null,null,{"$f":"+[4]DATOS!L57","v":77.601164408544676},"°C","A","N",{"$f":"+[4]DATOS!L58","v":3.8439014374678962E-2},"%hr",3,{"$f":"I70/K70","v":1.2813004791559654E-2},{"$f":"+J70","v":"%hr"},8,1,"--",{"$f":"ABS(L70*O70)","v":1.2813004791559654E-2},"%hr",{"$f":"(Q70*100%)^2/$L$82^2","v":1.0953969176857575E-4}]
[2,"Incertidumbre del termómetro patrón 1",null,null,0,"-","B","N",1.7,"%hr",2,{"$f":"I71/K71","v":0.85},{"$f":"+J71","v":"%hr"},199.99999999999966,1,"--",{"$f":"ABS(L71*O71)","v":0.85},"%hr",{"$f":"(Q71*100%)^2/$L$82^2","v":0.48206698455029628}]
[3,"Interpolación corrección patrón",null,null,0,"-","B","N",{"$f":"+SQRT('[4]interpolación pat'!$C$18/(3-2))","v":0.3180299060332894},"%hr",{"$f":"+K51","v":1.7320508075688772},0.18361465185867104,"%hr",199.99999999999966,1,"--",0.18361465185867104,"%hr",2.249490713042205E-2]
[4,"Efecto de la temperatura del patrón",null,null,0,"%hr","B","R",{"$f":"+MAX(I71,I77)","v":1.7},"°C",1.7320508075688772,0.98149545762236379,"°C",1000000,{"$f":"+ABS([4]DATOS!$B$42-[4]DATOS!$B$103)/ABS([4]DATOS!$C$42-[4]DATOS!$C$103)","v":7.258514796203301E-3},"%hr/°C",7.1241993015582579E-3,"%hr",{"$f":"(Q73*100%)^2/$L$40^2","v":3.5443995398187899E-5}]
[5,"Resolución indicador patrón",null,null,0,"-","B","R",0.1,"%hr",1.7320508075688772,5.7735026918962581E-2,"%hr",1000000,1,"--",5.7735026918962581E-2,"%hr",2.2240691328733399E-3]
[6,"Deriva del termómetro patrón 1",null,null,0,"-","B","R",{"$f":"+I33","v":0.7},"%hr",1.7320508075688772,0.40414518843273806,"%hr",1000000,1,"--",0.40414518843273806,"%hr",0.10897938751079365]
[7,"Uniformidad del medio",null,null,0,"-","B","R",{"$f":"+'[4]Interpolación hor '!C9","v":1.25},"%hr",1.7320508075688772,0.72168783648703227,"%hr",1000000,1,"--",0.72168783648703227,"%hr",0.3475108020114594]
[8,"Estabilidad",null,null,0,"-","B","R",{"$f":"+'[4]Interpolación hor '!D9","v":0.35},"%hr",1.7320508075688772,0.20207259421636903,"%hr",1000000,1,"--",0.20207259421636903,"%hr",2.7244846877698414E-2]
[9,"Repetibilidad del termómetro IBC",null,null,{"$f":"+[4]DATOS!D57","v":77.48888888888888},"°C","A","N",{"$f":"+[4]DATOS!D58","v":3.3333333333331439E-2},"%hr",3,1.111111111111048E-2,"%hr",8,1,"--",1.111111111111048E-2,"%hr",8.237293084715137E-5]
[9,"Resolución indicador IBC",null,null,0,"-","B","R",{"$f":"+I58","v":0.1},"%hr",1.7320508075688772,5.7735026918962581E-2,"%hr",1000000,1,"--",5.7735026918962581E-2,"%hr",2.2240691328733399E-3]
[10,"Histéresis",null,null,1,"-","A","R",{"$f":"+I59","v":0.1777777777777878},"%hr",1.7320508075688772,0.10264004785593926,"%hr",1000000,1,"--",0.10264004785593926,"%hr",7.0291567656251752E-3]
[12,"Efecto de la temperatura del patrón",null,null,0,"°C","B","R",{"$f":"+I73","v":1.7},"°C",1.7320508075688772,0.98149545762236379,"°C",1000000,{"$f":"+ABS([4]DATOS!$D$42-[4]DATOS!$B$103)/ABS([4]DATOS!$E$42-[4]DATOS!$E$103)","v":9.4026548672563395E-3},"%hr/°C",9.2286630418029064E-3,"%hr",{"$f":"(Q81*100%)^2/$L$40^2","v":5.9476873228475238E-5}]
[null,"Corrección",null,null,{"$f":"+E70-E78","v":0.11227551965579607},"%hr","A","N",{"$f":"L82*K82","v":2.4028485093858207},"%hr",{"$f":"TINV(0.05,N82)","v":1.9627327075354923},{"$f":"(SUMSQ(Q70:Q80)^0.5)","v":1.2242362396879605},"°C",{"$f":"L82^4/(Q70^4/N70+Q71^4/N71+Q72^4/N72+Q74^4/N74+Q75^4/N75+Q76^4/N76+Q77^4/N77+Q78^4/N78+Q79^4/N79+Q80^4/N80)","v":858.65744393087277},null,null,null,null,{"$f":"SUM(S70:S80)","v":1.0000015797300554}]
[]
[null,null,null,null,"Corrección   C (°C)","K",null,"°C"]
[null,null,null,null,{"$f":"+E82","v":0.11227551965579607},{"$f":"+K82","v":1.9627327075354923},"±",{"$f":"+I82","v":2.4028485093858207}]
[null,null,null,null,null,null,null,null,"SE HACE REDONDEO DE DECIMALES TAL COMO LO RECOMIENDA LA GUM"]
[]
[]
["SP °C",{"$f":"+[4]DATOS!B61","v":0},null,null,null,null,null,null,null,null,null,"Incertidumbre Standard",null,"Grados de Libertad","Coeficiente de Sensibilidad",null,null,null,"Porcentaje"]
[null,"Fuente de Incertidumbre",null,null,"Valor Estimado","Unidad","Tipo","Distribución","u","Unidad","Factor","u típica","Unidad","G.L.","Ci","Unidad","Contribución a u","Unidad","%"]
[null,"Repetibilidad del Patrón 1",null,null,{"$f":"+[4]DATOS!B63","v":0},"°C","A","N",{"$f":"+[4]DATOS!B73","v":{"$error":"#DIV/0!"}},"°C",3,{"$f":"I91/K91","v":{"$error":"#DIV/0!"}},{"$f":"+J91","v":"°C"},8,1,"--",{"$f":"ABS(L91*O91)","v":{"$error":"#DIV/0!"}},"°C",{"$f":"(Q91*100%)^2/$L$82^2","v":{"$error":"#DIV/0!"}},null,null,"Uniformidad °C","Estabilidad °C"]
[null,"Incertidumbre del Termómetro Patrón 1",null,null,0,"-","B","N",{"$f":"+IF(E91<200,V99,V98)","v":0},"°C",2,{"$f":"I92/K92","v":0},{"$f":"+J92","v":"°C"},199.99999999999966,1,"--",0,"°C",{"$f":"(Q92*100%)^2/$L$82^2","v":0},null,9150,{"$f":"+[4]Incertidumbre!E91^2*'[4]Interpolación hor '!#REF!++[4]Incertidumbre!E91*'[4]Interpolación hor '!#REF!+'[4]Interpolación hor '!#REF!","v":{"$error":"#REF!"}},{"$f":"+E91^2*'[4]Interpolación hor '!#REF!+E91*'[4]Interpolación hor '!#REF!+'[4]Interpolación hor '!#REF!","v":{"$error":"#REF!"}}]
[null,"Resolución Indicador patrón",null,null,0,"-","B","R",1E-3,"Ohm",1.7320508075688772,5.773502691896258E-4,"Ohm",1000000,3.9249999999999997E-3,"°C/Ohm",2.2660998065692812E-6,"°C",3.4263175035121843E-12,null,7103,{"$f":"+E91*'[4]Interpolación hor '!$B$19+'[4]Interpolación hor '!$C$19","v":-1.6033333333333278E-2},{"$f":"+E91*'[4]Interpolación hor '!$B$26+'[4]Interpolación hor '!$C$26","v":-3.2849999999999949E-2}]
[null,"Deriva del Termómetro Patrón 1",null,null,0,"-","B","R",{"$f":"+IF($E91<200,[4]Incertidumbre!W99,[4]Incertidumbre!W98)","v":0.01},"°C",1.7320508075688772,5.773502691896258E-3,"°C",1000000,1,"--",5.773502691896258E-3,"°C",2.2240691328733396E-5,null,6330,{"$f":"+E91*'[4]Interpolación hor '!#REF!+'[4]Interpolación hor '!#REF!","v":{"$error":"#REF!"}},{"$f":"+E91*'[4]Interpolación hor '!#REF!+'[4]Interpolación hor '!#REF!","v":{"$error":"#REF!"}}]
[null,"Incertidumbre del indicador",null,null,0,"-","B","R",{"$f":"+IF(E91<200,[4]Incertidumbre!X99,[4]Incertidumbre!X98)","v":{"$error":"#DIV/0!"}},{"$f":"+IF([4]DATOS!#REF!<200, \"Ohm\", \"mV\")","v":{"$error":"#REF!"}},2,{"$error":"#DIV/0!"},{"$error":"#REF!"},200,3.9249999999999997E-3,"--",{"$error":"#DIV/0!"},"°C",{"$error":"#DIV/0!"}]
[null,"Deriva del indicador",null,null,0,"-","B","R",{"$f":"+IF(E91<200,[4]Incertidumbre!X99,X98)","v":{"$error":"#DIV/0!"}},{"$f":"+IF([4]DATOS!#REF!<200, \"Ohm\", \"mV\")","v":{"$error":"#REF!"}},1.7320508075688772,{"$error":"#DIV/0!"},{"$error":"#REF!"},1000000,3.9250999999999999E-3,"°C/Ohm",{"$error":"#DIV/0!"},"°C",{"$error":"#DIV/0!"}]
[null,"Uniformidad del medio",null,null,0,"-","B","R",{"$f":"+IF([4]DATOS!E65=7103,V93,IF([4]DATOS!E65=6330,V94,IF([4]DATOS!E65=9150,V92,\"REVISAR\")))","v":"REVISAR"},"°C",1.7320508075688772,{"$error":"#VALUE!"},"°C",1000000,1,"--",{"$error":"#VALUE!"},"°C",{"$error":"#VALUE!"},null,null,"U sensor °C","deriva °C","U indicador ohm","Resolución"]
[null,"Estabilidad",null,null,0,"-","B","R",{"$f":"+IF([4]DATOS!E65=7103,W93,IF([4]DATOS!E65=6330,W94,IF([4]DATOS!E65=9150,W92,\"REVISAR\")))","v":"REVISAR"},"°C",1.7320508075688772,{"$error":"#VALUE!"},"°C",1000000,1,"--",{"$error":"#VALUE!"},"°C",{"$error":"#VALUE!"},null,"Ter Tipo R",{"$f":"[4]DATOS!B826^3*'[4]interpolación pat'!$B$24+[4]DATOS!B72^2*'[4]interpolación pat'!$C$11+[4]DATOS!B72*'[4]interpolación pat'!$D$21+'[4]interpolación pat'!$E$21","v":{"$error":"#DIV/0!"}},0.5,{"$f":"+[4]DATOS!B72^4*#REF!+[4]DATOS!B72^3*#REF!+[4]DATOS!B72^2*#REF!+[4]DATOS!B72*#REF!+#REF!","v":{"$error":"#DIV/0!"}},1.0000000000000001E-5]
[null,"Repetibilidad del Termómetro IBC",null,null,{"$f":"+[4]DATOS!#REF!","v":{"$error":"#REF!"}},"°C","A","N",{"$f":"+[4]DATOS!#REF!","v":{"$error":"#REF!"}},"Ohm",3,{"$error":"#REF!"},"Ohm",8,3.9249999999999997E-3,"--",{"$error":"#REF!"},"°C",{"$error":"#REF!"},null,"PRT pt 100",{"$f":"+(E91^4*'[4]interpolación pat'!$I$14+E91^3*'[4]interpolación pat'!$J$14+E91^2*'[4]interpolación pat'!$K$14+E91*'[4]interpolación pat'!$L$14+'[4]interpolación pat'!$M$14)","v":0},0.01,{"$f":"+[4]DATOS!B72^4*#REF!+[4]DATOS!B72^3*#REF!+[4]DATOS!B72^2*#REF!+[4]DATOS!B72*#REF!+#REF!","v":{"$error":"#DIV/0!"}},1E-4]
[null,"Resolución Indicador patrón",null,null,0,"-","B","R",1E-3,"Ohm",1.7320508075688772,5.773502691896258E-4,"Ohm",1000000,3.9249999999999997E-3,"°C/Ohm",2.2660998065692812E-6,"°C",3.4263175035121843E-12]
[null,"Variación en cero",null,null,{"$f":"+ABS([4]DATOS!#REF!-[4]DATOS!$J$88)","v":{"$error":"#REF!"}},"Ohm","A","R",{"$f":"+E101/2","v":{"$error":"#REF!"}},"°C",1.7320508075688772,{"$error":"#REF!"},"°C",1000000,1,"--",{"$error":"#REF!"},"°C",{"$f":"(Q101*100%)^2/$L$102^2","v":{"$error":"#REF!"}}]
[null,"Corrección",null,null,{"$f":"+E91-E99","v":{"$error":"#REF!"}},"-","A","N",{"$f":"L102*K102","v":{"$error":"#DIV/0!"}},"°C",{"$f":"TINV(0.05,N102)","v":{"$error":"#DIV/0!"}},{"$f":"(SUMSQ(Q91:Q101)^0.5)","v":{"$error":"#DIV/0!"}},"°C",{"$f":"L102^4/(Q91^4/N91+Q92^4/N92+Q93^4/N93+Q94^4/N94+Q95^4/N95+Q96^4/N96+Q97^4/N97+Q98^4/N98+Q99^4/N99+Q100^4/N100+Q101^4/N101)","v":{"$error":"#DIV/0!"}},null,null,null,null,{"$f":"SUM(S91:S101)","v":{"$error":"#DIV/0!"}}]
[null,null,null,null,"Corrección   C (°C)","K",null,"°C"]
[null,null,null,null,{"$f":"+E102","v":{"$error":"#REF!"}},{"$f":"+K101","v":1.7320508075688772},"±",{"$f":"+I102","v":{"$error":"#DIV/0!"}}]
[null,null,null,null,null,null,null,null,"SE HACE REDONDEO DE DECIMALES TAL COMO LO RECOMIENDA LA GUM"]

{"sheet":"interpolación pat","index":4,"n_rows":26,"n_cols":18,"rows_kept":26,"cut":false,"hidden":true,"merged":[[0,0,2,2],[0,3,2,17],[4,1,4,3],[4,8,4,10],[21,1,21,5],[11,1,11,3],[11,8,11,10]]}
[null,null,null,"HOJA DE CÁLCULO PARA CALIBRACIÓN DE TERMOHIGRÓMETROS-HUMEDAD"]
[]
[]
[]
[null,"Patrón de  Humedad \nNúmero de certificado y fecha de calibración\n5287, 2021-06-23 ",null,null,null,null,null,null,"Patrón Temperatura\nNúmero de certificado y fecha de calibración\n5286, 2021-06-25 "]
[null,"Valor medido % hr","Corrección % hr","U % hr",null,null,null,null,"Valor medido °C","Corrección °C","U °C"]
[null,33.4,-3.4,1.7,null,null,null,null,14.8,0,0.2]
[null,51.1,-1.1000000000000001,1.7,null,null,null,null,24.8,0.1,0.2,null,null,null,null,40,0.06,0.2]
[null,76.8,3.2,1.7,null,null,null,null,29.8,0.1,0.2,null,null,null,null,50,7.0000000000000007E-2,4.3999999999999997E-2]
[]
[]
[null,"Lectura % hr",null,null,null,null,null,null,"Lectura"]
["grado poli",1,0,null,0,null,null,null,1,0]
["coef",{"$f":"+LINEST(C7:C9,B7:B9,TRUE,TRUE)","v":0.15317043124024446},-8.6687968530171453,{"$error":"#N/A"},null,null,null,null,{"$f":"+LINEST(J7:J9,I7:I9,TRUE,TRUE)","v":7.1428571428571461E-3},-9.8571428571428657E-2]
[null,1.0304991260637886E-2,0.58369718002745141,{"$error":"#N/A"},null,null,null,null,2.4743582965269695E-3,5.9283476721974593E-2]
[null,0.99549407390266376,0.3180299060332894,{"$error":"#N/A"},null,null,null,null,0.89285714285714279,2.6726124191242456E-2]
[null,220.92996032295059,1,{"$error":"#N/A"},null,null,null,null,8.3333333333333215,1]
[null,22.345523645535124,0.10114302113154289,{"$error":"#N/A"},null,null,null,null,5.9523809523809521E-3,7.1428571428571526E-4,null,null,"Termohigrómetro digital"]
[null,{"$error":"#N/A"},{"$error":"#N/A"},{"$error":"#N/A"}]
[]
[null,null,null,null,null,null,null,null,null,null,null,null,"No indica"]
[null,"Incertidumbre"]
[null,3,2,1,0]
[null,{"$f":"+LINEST(D7:D9,B7:B9^{1,2},1,1)","v":0},0,1.7,{"$error":"#N/A"},{"$error":"#N/A"}]
[null,0,0,0,{"$error":"#N/A"},{"$error":"#N/A"}]
[null,1,0,{"$error":"#N/A"},{"$error":"#N/A"},{"$error":"#N/A"}]

{"sheet":"Interpolación hor ","index":5,"n_rows":28,"n_cols":13,"rows_kept":28,"cut":false,"hidden":true,"merged":[[16,1,16,5],[23,1,23,5],[0,0,2,1],[0,2,2,7],[4,1,4,3],[4,4,4,6]]}
[null,null,"HOJA DE CÁLCULO PARA CALIBRACIÓN DE TERMOHIGRÓMETROS-HUMEDAD"]
[]
[]
[]
[null,"2022-02-10 MI-0888",null,null,"Laboratorio de Temperatura y Humedad"]
[null,"Valor medido  %hr","Uniformidad %hr","Estabilidad \n% hr","Valor medido °C","Uniformidad °C","Estabilidad °C"]
[null,30,1.19,0.26,10,0.46,7.9000000000000001E-2]
[null,50,1.1200000000000001,0.107,20,0.38,4.4999999999999998E-2]
[null,80,1.25,0.35,40,0.39,4.3999999999999997E-2]
[]
[null,{"$f":"+LINEST(C7:C9,B7:B9^{2},1,1)","v":1.5097875885047901E-5},1.1373469387755102,{"$error":"#N/A"}]
[null,1.7349363566027249E-5,6.9411910561373219E-2,{"$error":"#N/A"}]
[null,0.43094330774250994,6.9411910561373219E-2,{"$error":"#N/A"}]
[null,0.75729415646255893,1,{"$error":"#N/A"}]
[]
[]
[null,"Uniformidad"]
[null,2,1,0,null,null,null,null,null,null,null,null,"Termohigrómetro digital"]
[null,{"$f":"+LINEST(C7:C9,B7:B9^{1,2},1,1)","v":1.5666666666666617E-4},-1.6033333333333278E-2,1.5299999999999987,{"$error":"#N/A"},{"$error":"#N/A"}]
[null,0,0,0,{"$error":"#N/A"},{"$error":"#N/A"}]
[null,1,0,{"$error":"#N/A"},{"$error":"#N/A"},{"$error":"#N/A"},null,null,null,null,null,null,"No indica"]
[]
[]
[null,"Estabilidad"]
[null,2,1,0]
[null,{"$f":"+LINEST(D7:D9,B7:B9^{1,2},1,1)","v":3.1499999999999958E-4},-3.2849999999999949E-2,0.96199999999999886,{"$error":"#N/A"},{"$error":"#N/A"}]
[null,0,0,0,{"$error":"#N/A"},{"$error":"#N/A"}]
[null,1,0,{"$error":"#N/A"},{"$error":"#N/A"},{"$error":"#N/A"}]

{"sheet":"RT03-F61.","index":6,"n_rows":111,"n_cols":17,"rows_kept":111,"cut":false,"hidden":false,"merged":[[108,1,108,4],[104,7,104,10],[105,7,105,10],[104,1,104,5],[105,1,105,5],[92,1,92,11],[93,1,93,11],[101,5,101,7],[102,7,102,10],[103,7,103,10],[102,1,102,5],[103,1,103,5],[55,3,55,4],[56,3,56,4],[57,3,57,4],[53,1,53,2],[54,1,54,2],[55,1,55,2],[56,1,56,2],[57,1,57,2],[41,0,41,11],[38,9,38,10],[43,0,43,11],[47,6,47,7],[48,6,48,7],[47,4,47,5],[48,4,48,5],[39,0,39,11],[18,0,18,2],[13,3,13,11],[14,3,14,11],[15,3,15,11],[16,3,16,11],[17,3,17,11],[13,0,13,2],[14,0,14,2],[15,0,15,2],[16,0,16,2],[17,0,17,2],[33,3,33,11],[34,3,34,11],[34,0,34,2],[33,0,33,2],[6,3,6,11],[7,3,7,11],[28,0,28,11],[30,0,30,11],[9,0,9,2],[9,3,9,5],[9,8,9,9],[6,0,6,1],[10,0,10,1],[10,3,10,5],[11,0,11,9],[7,0,7,1],[110,0,110,10],[108,8,108,9],[85,0,85,5],[73,0,73,11],[80,0,80,11],[87,1,87,11],[88,1,88,11],[99,0,99,3],[94,1,94,11],[95,1,95,11],[96,1,96,11],[97,1,97,11],[84,9,84,10],[89,1,89,11],[90,1,90,11],[91,1,91,11],[53,10,54,10],[45,0,45,10],[47,1,47,3],[48,1,48,3],[51,0,51,10],[49,1,49,3],[49,6,49,7],[49,4,49,5],[53,3,53,4],[54,3,54,4],[0,0,0,10],[2,9,2,10],[5,0,5,1],[3,0,3,11],[5,3,5,11],[26,0,26,7],[22,0,22,11],[19,0,19,3],[19,4,19,7],[20,0,20,10],[23,0,23,10],[24,0,24,3],[24,4,24,7]]}
[]
[]
[null,null,null,null,null,null,null,null,"Certificado N°",{"$f":"+'DATOS 0 '!L5","v":0}]
["Información del Cliente"]
[]
["Solicitante:",null,null,{"$f":"+'DATOS 0 '!D5","v":0}]
["Dirección:",null,null,{"$f":"+'DATOS 0 '!D6","v":0}]
["Ciudad :",null,null,{"$f":"+'DATOS 0 '!D7","v":0}]
[]
["Fecha de recepción:",null,null,{"$f":"'DATOS 0 '!D8","v":"00:00:00"},null,null,null,null,"Fecha de calibración:",null,{"$f":"'DATOS 0 '!D9","v":"00:00:00"}]
[]
["1.   INFORMACIÓN DEL EQUIPO SOMETIDO A CALIBRACIÓN"]
[]
["Objeto:",null,null,{"$f":"+'DATOS 0 '!D12","v":0}]
["Fabricante:",null,null,{"$f":"+'DATOS 0 '!D13","v":0}]
["Número de serie:",null,null,{"$f":"+'DATOS 0 '!D15","v":0}]
["Modelo:",null,null,{"$f":"+'DATOS 0 '!D14","v":"00:00:00"}]
["Intervalo de calibración:",null,null,{"$f":"CONCATENATE('DATOS 0 '!K12,\" \",'DATOS 0 '!M12,\" a\",\" \",'DATOS 0 '!L12,\" \",'DATOS 0 '!M12)","v":" 30 a  30"}]
["Resolución:",null,null,{"$f":"+'DATOS 0 '!K13","v":0},"% hr"]
[]
["2.   LUGAR Y DIRECCIÓN DE CALIBRACIÓN"]
[]
["Laboratorio de temperatura y humedad, avenida carrera 50 # 26-55, interior 2 del CAN, piso 5."]
[]
["3.   CÓDIGO INTERNO",null,null,null,{"$f":"+'DATOS 0 '!L6","v":0}]
[]
["4.   MÉTODO DE CALIBRACIÓN UTILIZADO "]
[]
["Para la calibración del termohigrómetro en temperatura ambiente, se utilizó el método establecido en el procedimiento técnico INTI, PEC16 de agosto 2015."]
[]
["5.  CONDICIONES AMBIENTALES"]
[]
["La calibración se realizó bajo condiciones ambientales de: "]
["Temperatura:",null,null,"23 °C ± 5 °C"]
["Humedad Relativa: ",null,null,"37,5 % hr ± 32,5 % hr"]
[]
[]
[]
[null,null,null,null,null,null,null,null,"Certificado N°",{"$f":"J3","v":0}]
["6.   INCERTIDUMBRE DE MEDICIÓN"]
[]
["\"La incertidumbre expandida de la medición reportada se establece como la incertidumbre estándar de medición multiplicada por el factor de cobertura \"k\",y la probabilidad de cobertura,  la cual debe ser aproximada al 95 % y no menor a este valor\" de acuerdo con el documento: \"CGM 100:2008. GUM 1995\"."]
[]
["7.   TRAZABILIDAD METROLÓGICA"]
[]
["Propiedad de un resultado de medida por la cual el resultado puede relacionarse con una referencia mediante una cadena ininterrumpida y documentada de calibraciones, cada una de las cuales contribuye a la incertidumbre de medida."]
[]
[null,"Instrumento",null,null,"Fabricante",null,"No. de Serie",null,"N° Certificado","Trazabilidad","Fecha de calibración"]
[null,{"$f":"+'DATOS 0 '!E26","v":"Cámara climática"},null,null,{"$f":"+'DATOS 0 '!E27","v":"Memmer"},null,{"$f":"+'DATOS 0 '!E28","v":"W421.0373"},null,{"$f":"+'DATOS 0 '!E30","v":"MI-0888"},{"$f":"+'DATOS 0 '!E31","v":"Unión Metrológica"},{"$f":"+'DATOS 0 '!E24","v":"2021-06-25 // 2021-06-23"}]
[null,{"$f":"+'DATOS 0 '!E18","v":"Termohigrómetro data logger"},null,null,{"$f":"+'DATOS 0 '!E19","v":"Lufft"},null,{"$f":"+'DATOS 0 '!E20","v":"022.0714.0802.024 "},null,{"$f":"+'DATOS 0 '!E22","v":"5286 // 5287"},{"$f":"+'DATOS 0 '!E23","v":"INM"},{"$f":"+'DATOS 0 '!E32:I32","v":"2022-02-10"},0,0,0,0]
[]
["8.   RESULTADOS DE LA CALIBRACIÓN"]
[]
[null,"Valor Nominal",null,"Temperatura del patrón",null,"Lectura promedio\nIBC","Corrección","Incertidumbre  Expandida  ± U","Factor de cobertura\nk= 95 %","Límite  de Aceptación LA","Cumple"]
[null,"% hr",null,"% hr",null,"% hr","% hr","% hr","% hr","% hr",null,null,"EMP +","EMP -",null,"LA","LA"]
[null,30,null,{"$f":"+Incertidumbre!E28","v":28.78361615270768},null,{"$f":"+Incertidumbre!E36","v":31.722222222222214},{"$f":"+Incertidumbre!E43","v":-2.9386060695145346},{"$f":"+Incertidumbre!H43","v":2.3490088411037702},{"$f":"+Incertidumbre!F43","v":1.9629983142029626},{"$f":"+$G$76-H56","v":2.6509911588962298},{"$f":"+IF(ABS(G56)<J56,\"SI\",\"NO\")","v":"NO"},null,{"$f":"+$G$76","v":5},{"$f":"-M56","v":-5},0,{"$f":"+J56","v":2.6509911588962298},{"$f":"-P56","v":-2.6509911588962298}]
[null,50,null,{"$f":"+Incertidumbre!E49","v":49.425366871908054},null,{"$f":"+Incertidumbre!E57","v":50.333333333333336},{"$f":"+Incertidumbre!E64","v":-0.90796646142528203},{"$f":"+Incertidumbre!H64","v":2.1451818776216927},{"$f":"+Incertidumbre!F43","v":1.9629983142029626},{"$f":"+$G$76-H57","v":2.8548181223783073},{"$f":"+IF(ABS(G57)<J57,\"SI\",\"NO\")","v":"SI"},null,5,{"$f":"-M57","v":-5},{"$f":"+($D$57-$D$56)/2+$D$56","v":39.104491512307867},{"$f":"+J56","v":2.6509911588962298},{"$f":"-P57","v":-2.6509911588962298}]
[null,80,null,{"$f":"+Incertidumbre!E70","v":77.601164408544676},null,{"$f":"+Incertidumbre!E78","v":77.48888888888888},{"$f":"+Incertidumbre!E85","v":0.11227551965579607},{"$f":"+Incertidumbre!H85","v":2.4028485093858207},{"$f":"+Incertidumbre!F85","v":1.9627327075354923},{"$f":"+$G$76-H58","v":2.5971514906141793},{"$f":"+IF(ABS(G58)+H58<J58,\"SI\",\"NO\")","v":"SI"},null,5,-5,{"$f":"+($D$57-$D$56)/2+$D$56","v":39.104491512307867},{"$f":"+J57","v":2.8548181223783073},-2.8548181223783073]
[null,null,null,null,null,null,null,null,null,null,null,null,5,-5,{"$f":"+($D$58-$D$57)/2+$D$57","v":63.513265640226365},{"$f":"+J57","v":2.8548181223783073},-2.8548181223783073]
[null,null,null,null,null,null,null,null,null,null,null,null,5,-5,{"$f":"+($D$58-$D$57)/2+$D$57","v":63.513265640226365},{"$f":"+J58","v":2.5971514906141793},-2.5971514906141793]
[null,null,null,null,null,null,null,null,null,null,null,null,5,-5,{"$f":"+($D$58-$D$57)/2+D58","v":91.689063176862987},{"$f":"+J58","v":2.5971514906141793},-2.5971514906141793]
[null,null,null,null,null,null,null,null,null,null,null,null,5,-5,{"$f":"+($D$58-$D$57)/2+D58","v":91.689063176862987},{"$f":"+J58","v":2.5971514906141793},-2.5971514906141793]
[]
[]
[]
[]
[]
[]
[]
[]
[]
[]
[]
["La declaración de conformidad se aplica teniendo en cuenta el error más la incertidumbre de medición, la cual no deberá superar los errores máximos permitidos (EMP), según lo definido en xxxxxx"]
[]
[null,null,null,null,null,"EMP",5,"hr"]
[]
[]
[]
[null,"\n"]
["El riesgo de que los valores  aceptados estén fuera del límite de tolerancia es < 2.5% y para losvalores rechazados, el riesgo de estar dentro del límite de tolerancia es <2.5%."]
[]
[]
[]
[null,null,null,null,null,null,null,null,"Certificado N°",{"$f":"J3","v":0}]
["10.   OBSERVACIONES"]
[]
["*","Los resultados obtenidos en esta calibración, aplican a la información del equipo descrito en el numeral uno (1) del presente certificado."]
["*","Los resultados obtenidos en el presente certificado se refieren al momento y condiciones en que se realizaron las mediciones."]
["*","Los laboratorios de la Superintendencia de Industria y Comercio no se responsabilizan de los perjuicios que puedan derivarse del uso inadecuado del equipo calibrado."]
["*","Se adhiere al equipo calibrado una estampilla identificada con el número del  certificado."]
["*","Se realiza medición en 0hr para calculara la histérisis del sensor de temperatura."]
["*","En el presente certificado se usa la coma “,” como separador decimal."]
["*","Este certificado de calibración no puede ser reproducido parcial, ni totalmente,  excepto  con  autorización  del  laboratorio  de la Superintendencia de Industria y Comercio."]
["*","El certificado de calibración sin las firmas autorizadas no es válido."]
["*","(* IBC) Instrumento bajo Calibración."]
["*","Los resultados de la calibración son trazables al Sistema Internacional (SI)."]
["*",{"$f":"+'DATOS 0 '!B57","v":0}]
[]
["FIRMAS AUTORIZADAS:"]
[]
[null,null,null,null,null,null,null,null,"SC"]
[]
["LH","Firma Autorizada",null,null,null,null,null,"Calibrado por"]
[null,{"$f":"VLOOKUP($G103,'DATOS 0 '!C64:P73,2,FALSE)","v":{"$error":"#N/A"}},null,null,null,null,null,{"$f":"VLOOKUP($L103,'DATOS 0 '!C64:P73,2,FALSE)","v":{"$error":"#N/A"}}]
[null,{"$f":"VLOOKUP($G103,'DATOS 0 '!C64:P73,7,FALSE)","v":{"$error":"#N/A"}},null,null,null,null,null,{"$f":"VLOOKUP($L103,'DATOS 0 '!C64:P73,11,FALSE)","v":{"$error":"#N/A"}}]
[]
[]
[null,"Fecha de elaboración:  ",null,null,null,null,null,null,"Fecha de emisión:  "]
[]
["…………………..Fin de este documento………………………"]

{"sheet":"RT03-F63","index":7,"n_rows":111,"n_cols":17,"rows_kept":111,"cut":false,"hidden":true,"merged":[[108,1,108,4],[108,8,108,9],[110,0,110,10],[103,1,103,5],[103,7,103,10],[104,1,104,5],[104,7,104,10],[105,1,105,5],[105,7,105,10],[102,1,102,5],[102,7,102,10],[89,1,89,11],[90,1,90,11],[91,1,91,11],[92,1,92,11],[93,1,93,11],[94,1,94,11],[95,1,95,11],[96,1,96,11],[97,1,97,11],[99,0,99,3],[101,5,101,7],[88,1,88,11],[55,1,55,2],[55,3,55,4],[56,1,56,2],[56,3,56,4],[57,1,57,2],[57,3,57,4],[73,0,73,11],[80,0,80,11],[84,9,84,10],[85,0,85,5],[87,1,87,11],[51,0,51,10],[53,1,53,2],[53,3,53,4],[53,10,54,10],[54,1,54,2],[54,3,54,4],[48,1,48,3],[48,4,48,5],[48,6,48,7],[49,1,49,3],[49,4,49,5],[49,6,49,7],[47,1,47,3],[47,4,47,5],[47,6,47,7],[28,0,28,11],[30,0,30,11],[33,0,33,2],[33,3,33,11],[34,0,34,2],[34,3,34,11],[38,9,38,10],[39,0,39,11],[41,0,41,11],[43,0,43,11],[45,0,45,10],[26,0,26,7],[16,0,16,2],[16,3,16,11],[17,0,17,2],[17,3,17,11],[18,0,18,2],[19,0,19,3],[19,4,19,7],[20,0,20,10],[22,0,22,11],[23,0,23,10],[24,0,24,3],[24,4,24,7],[15,0,15,2],[15,3,15,11],[7,0,7,1],[7,3,7,11],[9,0,9,2],[9,3,9,5],[9,8,9,9],[10,0,10,1],[10,3,10,5],[11,0,11,9],[13,0,13,2],[13,3,13,11],[14,0,14,2],[14,3,14,11],[6,0,6,1],[6,3,6,11],[0,0,0,10],[2,9,2,10],[3,0,3,11],[5,0,5,1],[5,3,5,11]]}
[]
[]
[null,null,null,null,null,null,null,null,"Certificado N°",{"$f":"+'DATOS 0 '!L5","v":0}]
["Información del Cliente"]
[]
["Solicitante:",null,null,{"$f":"+'DATOS 0 '!D5","v":0}]
["Dirección:",null,null,{"$f":"+'DATOS 0 '!D6","v":0}]
["Ciudad :",null,null,{"$f":"+'DATOS 0 '!D7","v":0}]
[]
["Fecha de recepción:",null,null,{"$f":"'DATOS 0 '!D8","v":"00:00:00"},null,null,null,null,"Fecha de calibración:",null,{"$f":"'DATOS 0 '!D9","v":"00:00:00"}]
[]
["1.   INFORMACIÓN DEL EQUIPO SOMETIDO A CALIBRACIÓN"]
[]
["Objeto:",null,null,{"$f":"+'DATOS 0 '!D12","v":0}]
["Fabricante:",null,null,{"$f":"+'DATOS 0 '!D13","v":0}]
["Número de serie:",null,null,{"$f":"+'DATOS 0 '!D15","v":0}]
["Modelo:",null,null,{"$f":"+'DATOS 0 '!D14","v":"00:00:00"}]
["Intervalo de calibración:",null,null,{"$f":"CONCATENATE('DATOS 0 '!K12,\" \",'DATOS 0 '!M12,\" a\",\" \",'DATOS 0 '!L12,\" \",'DATOS 0 '!M12)","v":" 30 a  30"}]
["Resolución:",null,null,{"$f":"+'DATOS 0 '!K13","v":0},"% hr"]
[]
["2.   LUGAR Y DIRECCIÓN DE CALIBRACIÓN"]
[]
["Laboratorio de temperatura y humedad, avenida carrera 50 # 26-55, interior 2 del CAN, piso 5."]
[]
["3.   CÓDIGO INTERNO",null,null,null,{"$f":"+'DATOS 0 '!L6","v":0}]
[]
["4.   MÉTODO DE CALIBRACIÓN UTILIZADO "]
[]
["Para la calibración del termohigrómetro en temperatura ambiente, se utilizó el método establecido en el procedimiento técnico INTI, PEC16 de agosto 2015."]
[]
["5.  CONDICIONES AMBIENTALES"]
[]
["La calibración se realizó bajo condiciones ambientales de: "]
["Temperatura:",null,null,"23 °C ± 5 °C"]
["Humedad Relativa: ",null,null,"37,5 % hr ± 32,5 % hr"]
[]
[]
[]
[null,null,null,null,null,null,null,null,"Certificado N°",{"$f":"J3","v":0}]
["6.   INCERTIDUMBRE DE MEDICIÓN"]
[]
["\"La incertidumbre expandida de la medición reportada se establece como la incertidumbre estándar de medición multiplicada por el factor de cobertura \"k\",y la probabilidad de cobertura,  la cual debe ser aproximada al 95 % y no menor a este valor\" de acuerdo con el documento: \"CGM 100:2008. GUM 1995\"."]
[]
["7.   TRAZABILIDAD METROLÓGICA"]
[]
["Propiedad de un resultado de medida por la cual el resultado puede relacionarse con una referencia mediante una cadena ininterrumpida y documentada de calibraciones, cada una de las cuales contribuye a la incertidumbre de medida."]
[]
[null,"Instrumento",null,null,"Fabricante",null,"No. de Serie",null,"N° Certificado","Trazabilidad","Fecha de calibración"]
[null,{"$f":"+'DATOS 0 '!E26","v":"Cámara climática"},null,null,{"$f":"+'DATOS 0 '!E27","v":"Memmer"},null,{"$f":"+'DATOS 0 '!E28","v":"W421.0373"},null,{"$f":"+'DATOS 0 '!E30","v":"MI-0888"},{"$f":"+'DATOS 0 '!E31","v":"Unión Metrológica"},{"$f":"+'DATOS 0 '!E24","v":"2021-06-25 // 2021-06-23"}]
[null,{"$f":"+'DATOS 0 '!E18","v":"Termohigrómetro data logger"},null,null,{"$f":"+'DATOS 0 '!E19","v":"Lufft"},null,{"$f":"+'DATOS 0 '!E20","v":"022.0714.0802.024 "},null,{"$f":"+'DATOS 0 '!E22","v":"5286 // 5287"},{"$f":"+'DATOS 0 '!E23","v":"INM"},{"$f":"+'DATOS 0 '!E32:I32","v":"2022-02-10"},0,0,0,0]
[]
["8.   RESULTADOS DE LA CALIBRACIÓN"]
[]
[null,"Valor Nominal",null,"Temperatura del patrón",null,"Lectura promedio\nIBC","Corrección","Incertidumbre  Expandida  ± U","Factor de cobertura\nk= 95 %","Límite  de Aceptación LA","Cumple"]
[null,"% hr",null,"% hr",null,"% hr","% hr","% hr","% hr","% hr",null,null,"EMP +","EMP -",null,"LA","LA"]
[null,30,null,{"$f":"+Incertidumbre!E28","v":28.78361615270768},null,{"$f":"+Incertidumbre!E36","v":31.722222222222214},{"$f":"+Incertidumbre!E43","v":-2.9386060695145346},{"$f":"+Incertidumbre!H43","v":2.3490088411037702},{"$f":"+Incertidumbre!F43","v":1.9629983142029626},{"$f":"+$G$76-H56","v":2.6509911588962298},{"$f":"+IF(ABS(G56)<J56,\"SI\",\"NO\")","v":"NO"},null,{"$f":"+$G$76","v":5},{"$f":"-M56","v":-5},0,{"$f":"+J56","v":2.6509911588962298},{"$f":"-P56","v":-2.6509911588962298}]
[null,50,null,{"$f":"+Incertidumbre!E49","v":49.425366871908054},null,{"$f":"+Incertidumbre!E57","v":50.333333333333336},{"$f":"+Incertidumbre!E64","v":-0.90796646142528203},{"$f":"+Incertidumbre!H64","v":2.1451818776216927},{"$f":"+Incertidumbre!F43","v":1.9629983142029626},{"$f":"+$G$76-H57","v":2.8548181223783073},{"$f":"+IF(ABS(G57)<J57,\"SI\",\"NO\")","v":"SI"},null,5,{"$f":"-M57","v":-5},{"$f":"+($D$57-$D$56)/2+$D$56","v":39.104491512307867},{"$f":"+J56","v":2.6509911588962298},{"$f":"-P57","v":-2.6509911588962298}]
[null,80,null,{"$f":"+Incertidumbre!E70","v":77.601164408544676},null,{"$f":"+Incertidumbre!E78","v":77.48888888888888},{"$f":"+Incertidumbre!E85","v":0.11227551965579607},{"$f":"+Incertidumbre!H85","v":2.4028485093858207},{"$f":"+Incertidumbre!F85","v":1.9627327075354923},{"$f":"+$G$76-H58","v":2.5971514906141793},{"$f":"+IF(ABS(G58)+H58<J58,\"SI\",\"NO\")","v":"SI"},null,5,-5,{"$f":"+($D$57-$D$56)/2+$D$56","v":39.104491512307867},{"$f":"+J57","v":2.8548181223783073},-2.8548181223783073]
[null,null,null,null,null,null,null,null,null,null,null,null,5,-5,{"$f":"+($D$58-$D$57)/2+$D$57","v":63.513265640226365},{"$f":"+J57","v":2.8548181223783073},-2.8548181223783073]
[null,null,null,null,null,null,null,null,null,null,null,null,5,-5,{"$f":"+($D$58-$D$57)/2+$D$57","v":63.513265640226365},{"$f":"+J58","v":2.5971514906141793},-2.5971514906141793]
[null,null,null,null,null,null,null,null,null,null,null,null,5,-5,{"$f":"+($D$58-$D$57)/2+D58","v":91.689063176862987},{"$f":"+J58","v":2.5971514906141793},-2.5971514906141793]
[null,null,null,null,null,null,null,null,null,null,null,null,5,-5,{"$f":"+($D$58-$D$57)/2+D58","v":91.689063176862987},{"$f":"+J58","v":2.5971514906141793},-2.5971514906141793]
[]
[]
[]
[]
[]
[]
[]
[]
[]
[]
[]
["La declaración de conformidad se aplica teniendo en cuenta el error más la incertidumbre de medición, la cual no deberá superar los errores máximos permitidos (EMP), según lo definido en xxxxxx"]
[]
[null,null,null,null,null,"EMP",5,"hr"]
[]
[]
[]
[null,"\n"]
["El riesgo de que los valores  aceptados estén fuera del límite de tolerancia es < 2.5% y para losvalores rechazados, el riesgo de estar dentro del límite de tolerancia es <2.5%."]
[]
[]
[]
[null,null,null,null,null,null,null,null,"Certificado N°",{"$f":"J3","v":0}]
["10.   OBSERVACIONES"]
[]
["*","Los resultados obtenidos en esta calibración, aplican a la información del equipo descrito en el numeral uno (1) del presente certificado."]
["*","Los resultados obtenidos en el presente certificado se refieren al momento y condiciones en que se realizaron las mediciones."]
["*","Los laboratorios de la Superintendencia de Industria y Comercio no se responsabilizan de los perjuicios que puedan derivarse del uso inadecuado del equipo calibrado."]
["*","Se adhiere al equipo calibrado una estampilla identificada con el número del  certificado."]
["*","Se realiza medición en 0hr para calculara la histérisis del sensor de temperatura."]
["*","En el presente certificado se usa la coma “,” como separador decimal."]
["*","Este certificado de calibración no puede ser reproducido parcial, ni totalmente,  excepto  con  autorización  del  laboratorio  de la Superintendencia de Industria y Comercio."]
["*","El certificado de calibración sin las firmas autorizadas no es válido."]
["*","(* IBC) Instrumento bajo Calibración."]
["*","Los resultados de la calibración son trazables al Sistema Internacional (SI)."]
["*",{"$f":"+'DATOS 0 '!B57","v":0}]
[]
["FIRMAS AUTORIZADAS:"]
[]
[null,null,null,null,null,null,null,null,"SC"]
[]
["LH","Firma Autorizada",null,null,null,null,null,"Calibrado por"]
[null,{"$f":"VLOOKUP($G103,'DATOS 0 '!C64:P73,2,FALSE)","v":{"$error":"#N/A"}},null,null,null,null,null,{"$f":"VLOOKUP($L103,'DATOS 0 '!C64:P73,2,FALSE)","v":{"$error":"#N/A"}}]
[null,{"$f":"VLOOKUP($G103,'DATOS 0 '!C64:P73,7,FALSE)","v":{"$error":"#N/A"}},null,null,null,null,null,{"$f":"VLOOKUP($L103,'DATOS 0 '!C64:P73,11,FALSE)","v":{"$error":"#N/A"}}]
[]
[]
[null,"Fecha de elaboración:  ",null,null,null,null,null,null,"Fecha de emisión:  "]
[]
["…………………..Fin de este documento………………………"]

{"sheet":"RT03-F64","index":8,"n_rows":107,"n_cols":10,"rows_kept":107,"cut":false,"hidden":true,"merged":[[106,0,106,10],[97,5,97,7],[97,13,97,15],[98,6,98,8],[99,1,99,4],[99,6,99,8],[100,1,100,4],[100,6,100,8],[101,1,101,4],[101,6,101,8],[102,2,102,5],[104,1,104,2],[104,6,104,7],[95,0,95,3],[82,6,82,7],[82,9,82,10],[84,0,84,5],[86,1,86,9],[87,1,87,9],[88,1,88,9],[89,1,89,9],[90,1,90,9],[91,1,91,9],[92,1,92,9],[93,1,93,9],[76,0,76,11],[46,0,46,10],[48,0,48,2],[48,4,48,5],[48,7,48,8],[49,0,49,2],[49,4,49,5],[49,7,49,8],[50,0,50,2],[50,4,50,5],[50,7,50,8],[52,0,52,10],[54,9,55,9],[44,0,44,4],[24,0,24,2],[24,3,24,10],[28,0,30,11],[32,0,32,4],[34,0,34,11],[35,0,35,1],[35,2,35,3],[36,0,36,1],[36,2,36,3],[37,9,37,10],[38,0,38,7],[40,0,42,11],[23,0,23,10],[15,0,15,2],[15,3,15,10],[16,0,16,2],[16,3,16,10],[17,0,17,2],[17,3,17,10],[18,0,18,2],[19,0,19,3],[19,4,19,7],[20,0,20,11],[22,0,22,10],[14,0,14,2],[14,3,14,10],[7,0,7,1],[7,3,7,10],[9,0,9,1],[9,4,9,5],[9,7,9,8],[9,9,9,10],[10,0,10,1],[10,3,10,5],[11,0,11,11],[13,0,13,2],[13,3,13,10],[6,0,6,1],[6,3,6,10],[0,0,0,10],[2,9,2,10],[3,0,3,3],[5,0,5,1],[5,3,5,10]]}
[]
[]
[null,null,null,null,null,null,null,null,"Informe N°",{"$f":"'[5]Datos 0'!Q5","v":0}]
["Información del Cliente"]
[]
["Solicitante:",null,null,{"$f":"'[5]Datos 0'!F5","v":0}]
["Dirección:",null,null,{"$f":"'[5]Datos 0'!F6","v":0}]
["Ciudad :",null,null,{"$f":"'[5]Datos 0'!F7","v":0}]
[]
["Fecha de recepción:",null,null,{"$f":"'[5]Datos 0'!F8","v":"00:00:00"}]
[]
["1.   INFORMACIÓN DEL EQUIPO "]
[]
["Objeto:",null,null,{"$f":"'[5]Datos 0'!D14","v":0}]
["Fabricante:",null,null,{"$f":"'[5]Datos 0'!D15","v":0}]
["Número de serie:",null,null,{"$f":"'[5]Datos 0'!D17","v":0}]
["Modelo:",null,null,{"$f":"'[5]Datos 0'!D16","v":"00:00:00"}]
["Intervalo de calibración:",null,null,{"$f":"CONCATENATE('DATOS 0 '!K12,\" \",'DATOS 0 '!M12,\" a\",\" \",'DATOS 0 '!L12,\" \",'DATOS 0 '!M12)","v":" 30 a  30"}]
["Resolución:",null,null,{"$f":"+'[6]DATOS 0'!L14","v":0.01},"°C"]
[]
["2.   LUGAR Y DIRECCIÓN "]
[]
["Laboratorio de calibración de temperatura y humedad, avenida carrera 50 # 26-55, interior 2 del CAN"]
[]
["3. CÓDIGO INTERNO",null,null,{"$f":"'DATOS 0 '!N6","v":"LCTH-"}]
[]
[]
[]
[]
[]
[]
[]
[]
[]
[]
[]
[]
[null,null,null,null,null,null,null,null,"Informe N°",{"$f":"J3","v":0}]
["4.   REGISTRO FOTOGRÁFICO"]
[]
[]
[]
[]
[]
[]
[]
[]
[]
[]
[]
[]
[]
[]
[]
[]
[]
[]
[]
[]
[]
[]
[]
[]
[]
[]
[]
[]
[]
[]
[]
[]
[]
[]
[]
[]
[]
[]
[]
[]
[]
[]
[]
[null,null,null,null,null,null,null,null,"Informe N°",{"$f":"J3","v":0}]
[]
["5. OBSERVACIONES"]
[]
[]
[]
[]
[]
[]
[]
[]
[]
[]
["FIRMAS AUTORIZADAS:"]
[]
[null,null,null,null,null,null,null,null,"SC"]
[]
["LH","Autorizado por",null,null,null,null,"Elaborado por"]
[null,{"$f":"VLOOKUP($F99,'DATOS 0 '!C64:P73,2,FALSE)","v":{"$error":"#N/A"}},null,null,null,null,{"$f":"VLOOKUP($J99,'DATOS 0 '!C64:P73,2,FALSE)","v":{"$error":"#N/A"}}]
[null,{"$f":"VLOOKUP($F99,'DATOS 0 '!C64:P73,7,FALSE)","v":{"$error":"#N/A"}},null,null,null,null,{"$f":"VLOOKUP($J99,'DATOS 0 '!C64:P73,11,FALSE)","v":{"$error":"#N/A"}}]
[]
[]
[null,"Fecha de elaboración:  ",null,"2021-06-21",null,null,"Fecha de emisión:  ",null,"2021-06-21"]
[]
["…………………..Fin de este documento………………………"]